program: Orca
programVersion: 4.2.1
elementType: Cl Cl F F F O N N N C C C C C C C C C C C C C C C C C C H H H H H H H H H H H H
charge: 0
multiplicity: 1
keywords: wb97x-d3
keywords: def2-TZVPP
keywords: def2/J RIJCOSX GRIDX6 NOFINALGRIDX
keywords: grid4 nofinalgrid
keywords: scfconv7
keywords: smallprint printgap noloewdin
keywords: NOSOSCF
formula: C18H12Cl2F3N3O
InChI: InChI=1/C18H12Cl2F3N3O/c1-26-8-12(16(25-26)17(22)23)18(27)24-15-5-3-10(21)7-11(15)9-2-4-13(19)14(20)6-9/h2-8,17,24H,1H3
39 atoms
Cl -0.649882 2.619994 2.111224
Cl 1.17095 4.872407 0.880128
F  5.307944 -3.152585 0.368975
F  -3.676625 -3.288921 -1.306814
F  -5.343705 -2.458506 -0.162149
O  -0.987944 -2.847382 0.200106
N  0.279515 -1.284526 -0.848879
N  -3.313072 0.909791 -0.53097
N  -4.154009 -0.110321 -0.388591
C  2.507852 -0.902824 0.018231
C  1.550304 -1.783416 -0.502787
C  -2.035847 -0.858281 -0.482863
C  2.190232 0.521874 0.259041
C  -3.399694 -1.185305 -0.348602
C  -0.890011 -1.761928 -0.352595
C  -2.038764 0.51904 -0.59893
C  3.788351 -1.374893 0.290965
C  1.873421 -3.119026 -0.708598
C  1.084262 0.882968 1.025425
C  2.987582 1.526827 -0.281417
C  4.075682 -2.70744 0.08439
C  3.138007 -3.594464 -0.403334
C  -3.991276 -2.544931 -0.207062
C  -3.812996 2.264684 -0.580667
C  0.763324 2.216691 1.212778
C  2.680268 2.861203 -0.077701
C  1.561344 3.212685 0.660274
H  0.261865 -0.380375 -1.295698
H  -1.238874 1.231924 -0.71924
H  4.544797 -0.711237 0.68976
H  1.145132 -3.793095 -1.134784
H  0.469976 0.126838 1.496117
H  3.848453 1.272005 -0.8848
H  -3.648008 -3.079691 0.676585
H  3.390359 -4.634039 -0.562631
H  -4.452978 2.453762 0.276967
H  -2.973164 2.951841 -0.553496
H  -4.376003 2.431041 -1.495961
H  3.304388 3.631839 -0.508213
elementType: Cl F O N C H
totalener: -2152.71844497 hartree
nucrepener: 2762.61437936 hartree
electener: -4915.33282433 hartree
oneelecener: -8451.84763659 hartree
twoeener: 3536.51481227 hartree
cpcmener: -0.04172227 hartree
kineticenergy: 2146.65499142 hartree
xcener: -155.486033942572 hartree
chargesum: 0.0000000
charge: -0.064411 -0.065866 -0.222115 -0.220665 -0.213821 -0.520480 -0.181176 0.121061 -0.300920 0.098757 0.114408 -0.115595 0.072499 0.009868 0.369592 -0.052995 -0.196151 -0.168730 -0.248579 -0.198708 0.291750 -0.188004 0.299181 -0.139809 0.046476 -0.137040 0.067851 0.185374 0.183106 0.141603 0.148462 0.156851 0.154918 0.109092 0.155991 0.131008 0.100344 0.129770 0.147104
qa: -0.0644 -0.0659 -0.2221 -0.2207 -0.2138 -0.5205 -0.1812 0.1211 -0.3009 0.0988 0.1144 -0.1156 0.0725 0.0099 0.3696 -0.0530 -0.1962 -0.1687 -0.2486 -0.1987 0.2917 -0.1880 0.2992 -0.1398 0.0465 -0.1370 0.0679 0.1854 0.1831 0.1416 0.1485 0.1569 0.1549 0.1091 0.1560 0.1310 0.1003 0.1298 0.1471
va: 1.2567 1.2549 1.0570 1.0381 1.0635 1.9886 3.2280 3.4085 2.9301 3.5249 3.7056 3.6085 3.4748 3.9694 4.1608 4.0474 3.8936 3.9685 3.9424 3.9938 3.9214 3.9174 4.2279 3.8721 3.8956 3.9907 3.9106 1.0017 0.9771 1.0079 1.0160 1.0088 0.9983 0.9913 0.9964 0.9921 1.0044 0.9927 1.0059
dispcorr: -0.022301458 hartree
energy: -2152.740746430811
dipole: 3.27886 -1.26091 2.01795 -0.10558 3.12447 3.01890 -7.43928 6.38474 -1.05455
magnitude: 3.78126 au
magnitude: 9.61121 debye
