program: Orca
programVersion: 4.2.1
elementType: Cl Cl F F F O N N N C C C C C C C C C C C C C C C C C C H H H H H H H H H H H H
charge: 0
multiplicity: 1
keywords: wb97x-d3
keywords: def2-TZVPP
keywords: def2/J RIJCOSX GRIDX6 NOFINALGRIDX
keywords: grid4 nofinalgrid
keywords: scfconv7
keywords: smallprint printgap noloewdin
keywords: NOSOSCF
formula: C18H12Cl2F3N3O
InChI: InChI=1/C18H12Cl2F3N3O/c1-26-8-12(16(25-26)17(22)23)18(27)24-15-5-3-10(21)7-11(15)9-2-4-13(19)14(20)6-9/h2-8,17,24H,1H3
39 atoms
Cl -0.277453 2.790617 2.557472
Cl 1.30576 4.998035 0.966824
F  5.266348 -3.068236 0.121784
F  -4.153514 -3.411976 -0.17858
F  -3.333624 -3.052727 -2.169401
O  -1.142207 -2.947067 -0.00801
N  0.149004 -1.164605 -0.585576
N  -3.547511 0.833033 -0.262418
N  -4.320422 -0.168905 -0.655077
C  2.451341 -0.807746 0.030997
C  1.434044 -1.686159 -0.373181
C  -2.202637 -0.88316 -0.411216
C  2.177749 0.625315 0.280938
C  -3.53195 -1.21841 -0.740067
C  -1.035663 -1.775553 -0.317376
C  -2.2719 0.461416 -0.107366
C  3.750349 -1.283126 0.177391
C  1.734997 -3.026707 -0.599686
C  1.217376 1.012077 1.212637
C  2.876755 1.610434 -0.410768
C  4.012873 -2.618653 -0.041064
C  3.024495 -3.500986 -0.422386
C  -4.110042 -2.508799 -1.194097
C  -4.120085 2.134388 -0.00564
C  0.94547 2.35316 1.425394
C  2.614344 2.951748 -0.19052
C  1.641944 3.329957 0.721166
H  0.107596 -0.212189 -0.915023
H  -1.518147 1.16118 0.217437
H  4.544626 -0.616111 0.487823
H  0.971717 -3.710025 -0.936786
H  0.682855 0.266614 1.787316
H  3.623436 1.333467 -1.14338
H  -5.121436 -2.378882 -1.582505
H  3.252325 -4.543995 -0.597884
H  -4.768015 2.095746 0.868245
H  -3.319319 2.845339 0.177285
H  -4.695196 2.459141 -0.867931
H  3.159655 3.706789 -0.740041
elementType: Cl F O N C H
totalener: -2152.72755848 hartree
nucrepener: 2739.43398718 hartree
electener: -4892.16154566 hartree
oneelecener: -8405.70127215 hartree
twoeener: 3513.53972649 hartree
cpcmener: -0.03504145 hartree
kineticenergy: 2146.64773476 hartree
xcener: -155.481826623885 hartree
chargesum: -0.0000000
charge: -0.066042 -0.063500 -0.221990 -0.217531 -0.220627 -0.469329 -0.181005 0.105978 -0.289543 0.112916 0.106963 -0.138881 0.050017 0.004342 0.375161 -0.021729 -0.194098 -0.160114 -0.258250 -0.202676 0.286157 -0.195082 0.323575 -0.139196 0.083737 -0.128541 0.042960 0.182228 0.133495 0.138902 0.147137 0.157168 0.153945 0.107132 0.152616 0.130956 0.102432 0.125207 0.145109
qa: -0.0660 -0.0635 -0.2220 -0.2175 -0.2206 -0.4693 -0.1810 0.1060 -0.2895 0.1129 0.1070 -0.1389 0.0500 0.0043 0.3752 -0.0217 -0.1941 -0.1601 -0.2583 -0.2027 0.2862 -0.1951 0.3236 -0.1392 0.0837 -0.1285 0.0430 0.1822 0.1335 0.1389 0.1471 0.1572 0.1539 0.1071 0.1526 0.1310 0.1024 0.1252 0.1451
va: 1.2577 1.2570 1.0573 1.0510 1.0532 2.0429 3.2303 3.4233 2.9201 3.4833 3.7526 3.6874 3.4933 4.0048 4.1617 4.0317 3.8882 3.9485 3.9502 4.0002 3.9313 3.9290 4.1910 3.8764 3.8875 3.9848 3.9536 1.0035 1.0155 1.0084 1.0267 1.0163 0.9997 0.9937 0.9979 0.9883 1.0019 0.9963 1.0064
dispcorr: -0.021276140 hartree
energy: -2152.748834618554
dipole: -2.16174 2.84029 0.67856 0.79772 2.55561 3.35333 -6.37642 5.60060 -0.77582
magnitude: 3.50816 au
magnitude: 8.91703 debye
