program: Orca
programVersion: 4.2.1
elementType: Cl Cl F F F O N N N C C C C C C C C C C C C C C C C C C H H H H H H H H H H H H
charge: 0
multiplicity: 1
keywords: wb97x-d3
keywords: def2-TZVPP
keywords: def2/J RIJCOSX GRIDX6 NOFINALGRIDX
keywords: grid4 nofinalgrid
keywords: scfconv7
keywords: smallprint printgap noloewdin
keywords: NOSOSCF
formula: C18H12Cl2F3N3O
InChI: InChI=1/C18H12Cl2F3N3O/c1-26-8-12(16(25-26)17(22)23)18(27)24-15-5-3-10(21)7-11(15)9-2-4-13(19)14(20)6-9/h2-8,17,24H,1H3
39 atoms
Cl 0.844656 2.983494 -2.474777
Cl 1.148015 4.740495 0.115468
F  4.99099 -3.347635 0.468976
F  -1.572847 0.76585 -1.503718
F  -1.303403 1.300878 0.595515
O  -1.452951 -3.504737 0.00094
N  -0.244111 -1.606662 0.330365
N  -4.807358 -1.214045 0.529719
N  -4.330979 -0.017948 0.218545
C  2.115808 -1.164481 0.335868
C  1.068643 -2.1014 0.326897
C  -2.658399 -1.526221 0.256807
C  1.857638 0.295983 0.284858
C  -3.034923 -0.17733 0.053899
C  -1.402177 -2.297362 0.174415
C  -3.854206 -2.148609 0.55694
C  3.435157 -1.594181 0.394978
C  1.384534 -3.461363 0.34829
C  1.502882 0.898689 -0.916068
C  1.991518 1.080435 1.426207
C  3.71171 -2.944322 0.419835
C  2.70439 -3.882513 0.389499
C  -2.250118 1.012203 -0.351135
C  -6.21609 -1.40021 0.799361
C  1.288332 2.265717 -0.975672
C  1.775793 2.446293 1.368798
C  1.422101 3.042461 0.168812
H  -0.325016 -0.628101 0.561066
H  -4.06979 -3.178363 0.792485
H  4.240382 -0.87065 0.406309
H  0.609773 -4.208226 0.342874
H  1.405141 0.303783 -1.814348
H  2.263966 0.625494 2.369384
H  -2.879927 1.891698 -0.485074
H  2.933491 -4.939935 0.405403
H  -6.366789 -1.722602 1.82746
H  -6.723059 -0.453251 0.644742
H  -6.634218 -2.143343 0.124137
H  1.880447 3.049927 2.259906
elementType: Cl F O N C H
totalener: -2152.72744727 hartree
nucrepener: 2817.60336275 hartree
electener: -4970.33081002 hartree
oneelecener: -8563.45619098 hartree
twoeener: 3593.12538096 hartree
cpcmener: -0.02684730 hartree
kineticenergy: 2146.63927424 hartree
xcener: -155.481195929544 hartree
chargesum: 0.0000000
charge: -0.069247 -0.070166 -0.223942 -0.216109 -0.225298 -0.499535 -0.177232 0.105367 -0.298107 0.101400 0.113084 -0.135689 -0.064255 -0.009616 0.414643 -0.031307 -0.182124 -0.170582 -0.167379 -0.161382 0.287012 -0.206919 0.316161 -0.153434 0.067036 -0.141393 0.062687 0.199576 0.173742 0.133840 0.158303 0.128173 0.147853 0.131012 0.150778 0.128599 0.113109 0.128230 0.143107
qa: -0.0692 -0.0702 -0.2239 -0.2161 -0.2253 -0.4995 -0.1772 0.1054 -0.2981 0.1014 0.1131 -0.1357 -0.0643 -0.0096 0.4146 -0.0313 -0.1821 -0.1706 -0.1674 -0.1614 0.2870 -0.2069 0.3162 -0.1534 0.0670 -0.1414 0.0627 0.1996 0.1737 0.1338 0.1583 0.1282 0.1479 0.1310 0.1508 0.1286 0.1131 0.1282 0.1431
va: 1.2491 1.2494 1.0549 1.0629 1.0590 2.0075 3.2671 3.4175 2.9775 3.4139 3.8328 3.6214 3.5889 4.0840 4.1271 4.0376 3.8995 3.9084 3.9725 3.9796 3.9300 3.9375 4.1380 3.8647 3.8530 3.9950 3.9144 1.0194 1.0032 1.0109 1.0376 1.0280 1.0048 0.9925 0.9992 0.9875 1.0083 0.9880 1.0068
dispcorr: -0.022415731 hartree
energy: -2152.749863002829
dipole: -17.53553 15.38268 -2.15284 -20.78086 20.59932 -0.18153 10.67478 -9.17245 1.50233
magnitude: 2.63148 au
magnitude: 6.68869 debye
