program: Orca
programVersion: 4.2.1
elementType: Cl Cl F F F O N N N C C C C C C C C C C C C C C C C C C H H H H H H H H H H H H
charge: 0
multiplicity: 1
keywords: wb97x-d3
keywords: def2-TZVPP
keywords: def2/J RIJCOSX GRIDX6 NOFINALGRIDX
keywords: grid4 nofinalgrid
keywords: scfconv7
keywords: smallprint printgap noloewdin
keywords: NOSOSCF
formula: C18H12Cl2F3N3O
InChI: InChI=1/C18H12Cl2F3N3O/c1-26-8-12(16(25-26)17(22)23)18(27)24-15-5-3-10(21)7-11(15)9-2-4-13(19)14(20)6-9/h2-8,17,24H,1H3
39 atoms
Cl 3.190478 4.119754 -0.887356
Cl 1.007332 4.942526 1.225676
F  5.139051 -3.016846 0.464636
F  -5.431783 -3.026321 -0.83304
F  -4.32342 -3.198555 1.036883
O  -1.253032 -2.985586 0.332712
N  0.004633 -1.255805 -0.434861
N  -3.784525 0.563791 -0.771602
N  -4.532568 -0.529566 -0.696188
C  2.27193 -0.832404 0.259667
C  1.292035 -1.742818 -0.158744
C  -2.367346 -1.051484 -0.396041
C  1.946514 0.593101 0.491625
C  -3.696458 -1.5167 -0.461534
C  -1.171722 -1.859525 -0.129488
C  -2.484202 0.310116 -0.601534
C  3.578433 -1.270626 0.450249
C  1.629591 -3.079527 -0.350172
C  2.623708 1.58321 -0.21086
C  0.978119 0.968103 1.422369
C  3.879649 -2.60266 0.262005
C  2.924545 -3.518134 -0.128538
C  -4.192339 -2.911052 -0.289816
C  -4.389411 1.854746 -1.0164
C  2.340025 2.922517 0.009501
C  0.696976 2.30346 1.646463
C  1.37367 3.286787 0.939263
H  -0.03663 -0.335558 -0.844101
H  -1.753999 1.104539 -0.62501
H  4.346531 -0.578341 0.771213
H  0.891818 -3.786141 -0.698127
H  3.371227 1.31309 -0.945321
H  0.449928 0.217782 1.995857
H  -3.544109 -3.65948 -0.741919
H  3.184287 -4.557688 -0.27827
H  -4.016353 2.279234 -1.946058
H  -5.463596 1.720409 -1.091507
H  -4.171463 2.536069 -0.196755
H  -0.047517 2.583587 2.379102
elementType: Cl F O N C H
totalener: -2152.72882223 hartree
nucrepener: 2678.84830314 hartree
electener: -4831.57712537 hartree
oneelecener: -8284.11401299 hartree
twoeener: 3452.53688762 hartree
cpcmener: -0.03725609 hartree
kineticenergy: 2146.64041659 hartree
xcener: -155.481161208853 hartree
chargesum: 0.0000000
charge: -0.063856 -0.065726 -0.221162 -0.214524 -0.218955 -0.491524 -0.172433 0.115780 -0.306416 0.123119 0.107686 -0.122828 0.004767 0.010860 0.398800 -0.019490 -0.196324 -0.162390 -0.167971 -0.234277 0.290876 -0.192469 0.289235 -0.155551 0.057247 -0.115067 0.041180 0.180891 0.154383 0.139876 0.145691 0.137260 0.153679 0.100781 0.152873 0.127684 0.114122 0.127895 0.146280
qa: -0.0639 -0.0657 -0.2212 -0.2145 -0.2190 -0.4915 -0.1724 0.1158 -0.3064 0.1231 0.1077 -0.1228 0.0048 0.0109 0.3988 -0.0195 -0.1963 -0.1624 -0.1680 -0.2343 0.2909 -0.1925 0.2892 -0.1556 0.0572 -0.1151 0.0412 0.1809 0.1544 0.1399 0.1457 0.1373 0.1537 0.1008 0.1529 0.1277 0.1141 0.1279 0.1463
va: 1.2559 1.2533 1.0586 1.0612 1.0381 2.0227 3.2463 3.4089 2.9497 3.4762 3.7317 3.5940 3.5079 3.9292 4.1405 4.0118 3.8897 3.9653 4.0205 3.9482 3.9261 3.9300 4.2513 3.8666 3.9375 3.9470 3.9317 1.0041 1.0011 1.0082 1.0227 1.0212 1.0038 0.9912 0.9977 0.9875 1.0086 0.9879 1.0060
dispcorr: -0.020033938 hartree
energy: -2152.748856168184
dipole: -7.85764 8.69466 0.83702 -4.75394 7.22121 2.46726 -3.47207 2.32068 -1.15138
magnitude: 2.84845 au
magnitude: 7.24018 debye
