program: Orca
programVersion: 4.2.1
elementType: Cl Cl F F F O N N N C C C C C C C C C C C C C C C C C C H H H H H H H H H H H H
charge: 0
multiplicity: 1
keywords: wb97x-d3
keywords: def2-TZVPP
keywords: def2/J RIJCOSX GRIDX6 NOFINALGRIDX
keywords: grid4 nofinalgrid
keywords: scfconv7
keywords: smallprint printgap noloewdin
keywords: NOSOSCF
formula: C18H12Cl2F3N3O
InChI: InChI=1/C18H12Cl2F3N3O/c1-26-8-12(16(25-26)17(22)23)18(27)24-15-5-3-10(21)7-11(15)9-2-4-13(19)14(20)6-9/h2-8,17,24H,1H3
39 atoms
Cl 0.275086 3.197463 2.242335
Cl 1.165531 4.774353 -0.329874
F  5.029753 -3.330647 0.224164
F  -1.585917 -0.584712 -2.699461
F  -1.144136 1.021996 -1.295742
O  -1.380481 -3.246427 0.94461
N  -0.179574 -1.548143 0.028839
N  -4.691617 -0.884547 0.271366
N  -4.220292 -0.10111 -0.687137
C  2.181475 -1.112312 0.099379
C  1.127471 -2.039445 0.137219
C  -2.577305 -1.419098 0.108506
C  1.928089 0.344637 0.003066
C  -2.943623 -0.40041 -0.803184
C  -1.33471 -2.159391 0.393018
C  -3.755769 -1.694939 0.772082
C  3.497317 -1.559849 0.117298
C  1.423042 -3.40056 0.210984
C  1.293609 1.023766 1.03876
C  2.32676 1.053764 -1.126368
C  3.755368 -2.911141 0.196718
C  2.736798 -3.838002 0.247165
C  -2.1711 0.304844 -1.854021
C  -6.078985 -0.806984 0.673775
C  1.058051 2.385748 0.942542
C  2.093565 2.414054 -1.223266
C  1.456541 3.084802 -0.191425
H  -0.24981 -0.590638 -0.277649
H  -3.969457 -2.398982 1.560126
H  4.313158 -0.84908 0.086059
H  0.636919 -4.136977 0.223992
H  0.988289 0.494706 1.932465
H  2.812516 0.540741 -1.945831
H  -2.793738 0.991667 -2.427062
H  2.954897 -4.896299 0.303134
H  -6.565113 -1.770806 0.540034
H  -6.154206 -0.507277 1.71681
H  -6.575609 -0.067869 0.053546
H  2.402438 2.955326 -2.1070
elementType: Cl F O N C H
totalener: -2152.72996009 hartree
nucrepener: 2793.60946195 hartree
electener: -4946.33942203 hartree
oneelecener: -8515.34672948 hartree
twoeener: 3569.00730744 hartree
cpcmener: -0.02785774 hartree
kineticenergy: 2146.63900444 hartree
xcener: -155.480808312034 hartree
chargesum: 0.0000000
charge: -0.064185 -0.067281 -0.223395 -0.214696 -0.214497 -0.495736 -0.181054 0.106889 -0.297996 0.124833 0.095267 -0.137194 -0.035532 -0.024360 0.406386 -0.028678 -0.189331 -0.171629 -0.167200 -0.194662 0.285830 -0.198163 0.328687 -0.153389 0.065761 -0.128972 0.047587 0.185731 0.175474 0.135490 0.150769 0.139508 0.149872 0.122809 0.151271 0.128520 0.128490 0.113771 0.145006
qa: -0.0642 -0.0673 -0.2234 -0.2147 -0.2145 -0.4957 -0.1811 0.1069 -0.2980 0.1248 0.0953 -0.1372 -0.0355 -0.0244 0.4064 -0.0287 -0.1893 -0.1716 -0.1672 -0.1947 0.2858 -0.1982 0.3287 -0.1534 0.0658 -0.1290 0.0476 0.1857 0.1755 0.1355 0.1508 0.1395 0.1499 0.1228 0.1513 0.1285 0.1285 0.1138 0.1450
va: 1.2561 1.2515 1.0553 1.0602 1.0677 2.0150 3.2482 3.4154 2.9618 3.4313 3.8192 3.6115 3.5814 4.0578 4.1507 4.0368 3.8832 3.9457 3.9373 3.9984 3.9297 3.9402 4.1587 3.8646 3.9229 3.9849 3.9303 1.0402 1.0015 1.0103 1.0298 1.0217 1.0026 0.9966 0.9984 0.9880 0.9878 1.0078 1.0061
dispcorr: -0.021314306 hartree
energy: -2152.751274393437
dipole: -15.65488 13.74696 -1.90792 -17.69810 17.95961 0.26151 0.58470 -0.76684 -0.18214
magnitude: 1.93435 au
magnitude: 4.91672 debye
