program: Orca
programVersion: 4.2.1
elementType: Cl Cl F F F O N N N C C C C C C C C C C C C C C C C C C H H H H H H H H H H H H
charge: 0
multiplicity: 1
keywords: wb97x-d3
keywords: def2-TZVPP
keywords: def2/J RIJCOSX GRIDX6 NOFINALGRIDX
keywords: grid4 nofinalgrid
keywords: scfconv7
keywords: smallprint printgap noloewdin
keywords: NOSOSCF
formula: C18H12Cl2F3N3O
InChI: InChI=1/C18H12Cl2F3N3O/c1-26-8-12(16(25-26)17(22)23)18(27)24-15-5-3-10(21)7-11(15)9-2-4-13(19)14(20)6-9/h2-8,17,24H,1H3
39 atoms
Cl 0.787894 3.477217 1.735207
Cl 1.204832 4.602058 -1.172188
F  4.972426 -3.375657 0.400222
F  -1.308124 1.049031 -1.073952
F  -1.64636 1.247227 1.072184
O  -1.471287 -3.402788 0.771478
N  -0.246515 -1.616627 0.068929
N  -4.828957 -1.313708 -0.204446
N  -4.357535 -0.079864 -0.288802
C  2.117417 -1.201296 -0.011988
C  1.061841 -2.102349 0.201042
C  -2.66865 -1.529563 0.084453
C  1.872835 0.232486 -0.30285
C  -3.05688 -0.18304 -0.119193
C  -1.409837 -2.265446 0.349279
C  -3.864096 -2.212852 0.023286
C  3.433096 -1.642658 0.047866
C  1.364006 -3.432668 0.499086
C  1.476887 1.094626 0.712148
C  2.062094 0.741096 -1.584022
C  3.700728 -2.963127 0.338568
C  2.679813 -3.858912 0.570703
C  -2.280219 1.080836 -0.113855
C  -6.241066 -1.551019 -0.369371
C  1.27485 2.441441 0.456557
C  1.857767 2.084199 -1.844419
C  1.462388 2.939486 -0.827664
H  -0.318232 -0.702425 -0.348099
H  -4.060296 -3.26692 0.129341
H  4.243188 -0.9440 -0.115705
H  0.57372 -4.142105 0.673398
H  1.331007 0.717976 1.715501
H  2.367264 0.080016 -2.384368
H  -2.92125 1.943237 -0.303947
H  2.902539 -4.891622 0.802713
H  -6.804286 -0.943495 0.335142
H  -6.552721 -1.30313 -1.382149
H  -6.449896 -2.600114 -0.179766
H  2.001516 2.476644 -2.841404
totalener: -2152.70522286 hartree
nucrepener: 2814.47061710 hartree
electener: -4967.17583995 hartree
oneelecener: -8556.67851954 hartree
twoeener: 3589.50267958 hartree
kineticenergy: 2146.67504027 hartree
xcener: -155.485199458241 hartree
chargesum: -0.0000000
charge: -0.049242 -0.054085 -0.205242 -0.213636 -0.196900 -0.422708 -0.187191 0.088004 -0.262513 0.091908 0.092672 -0.153647 -0.072796 0.015435 0.385215 -0.034949 -0.180139 -0.128286 -0.172554 -0.145593 0.273905 -0.180371 0.300647 -0.144960 0.063046 -0.127475 0.056083 0.186163 0.159016 0.119778 0.153011 0.121875 0.128596 0.112220 0.124797 0.122717 0.120079 0.096113 0.121005
qa: -0.0492 -0.0541 -0.2052 -0.2136 -0.1969 -0.4227 -0.1872 0.0880 -0.2625 0.0919 0.0927 -0.1536 -0.0728 0.0154 0.3852 -0.0349 -0.1801 -0.1283 -0.1726 -0.1456 0.2739 -0.1804 0.3006 -0.1450 0.0630 -0.1275 0.0561 0.1862 0.1590 0.1198 0.1530 0.1219 0.1286 0.1122 0.1248 0.1227 0.1201 0.0961 0.1210
va: 1.2693 1.2660 1.0822 1.0714 1.0878 2.0816 3.2720 3.4152 2.9374 3.4322 3.9108 3.6989 3.6182 4.0378 4.1474 4.0521 3.9025 3.9310 3.9741 3.9920 3.9863 3.9382 4.1528 3.8909 3.8968 4.0187 3.9706 1.0315 1.0096 1.0150 1.0427 1.0291 1.0121 0.9948 1.0076 0.9951 0.9917 0.9996 1.0160
dispcorr: -0.022219152 hartree
energy: -2152.727442007749
dipole: -17.42680 15.55113 -1.87567 -22.75378 22.34634 -0.40744 -4.87665 4.01247 -0.86419
magnitude: 2.10499 au
magnitude: 5.35045 debye
