program: Orca
programVersion: 4.2.1
elementType: Cl Cl F F O N N N C C C C C C C C C C C C C C C C C C H H H H H H H H H H H H H H H
charge: 0
multiplicity: 1
keywords: wb97x-d3
keywords: def2-TZVPP
keywords: def2/J RIJCOSX GRIDX6 NOFINALGRIDX
keywords: grid4 nofinalgrid
keywords: scfconv7
keywords: smallprint printgap noloewdin
keywords: NOSOSCF
formula: C18H15Cl2F2N3O
InChI: InChI=1/C18H15Cl2F2N3O/c1-25-7-11(15(24-25)17(21)22)18(26)23-12-4-2-3-8-9-5-6-10(13(8)12)14(9)16(19)20/h2-4,7,9-10,17,23H,5-6H2,1H3
41 atoms
Cl -2.193646 -2.528527 -0.074156
Cl -4.791595 -1.401337 0.532701
F  2.86389 -2.356299 2.121225
F  3.620978 -3.494199 0.422135
O  0.818507 -0.295298 0.929101
N  1.205968 1.730749 -0.006818
N  5.052503 0.058927 -0.553291
N  4.789336 -1.183225 -0.162349
C  -1.469822 0.469507 -1.095682
C  -3.507921 1.369495 -0.621559
C  -1.950227 1.032113 -2.46096
C  -3.344878 1.62924 -2.142557
C  -2.797371 0.041451 -0.521553
C  -1.225934 1.665747 -0.206757
C  -2.475688 2.230637 0.067007
C  -0.070402 2.268269 0.254432
C  -2.595811 3.409803 0.772665
C  -3.203832 -1.131945 -0.083617
C  -0.186049 3.45516 0.982065
C  -1.427924 4.020542 1.228002
C  1.580063 0.485446 0.37656
C  2.961093 0.106917 0.06353
C  3.530676 -1.172816 0.219972
C  3.995061 0.867561 -0.446382
C  2.885058 -2.402448 0.756781
C  6.348312 0.407262 -1.095046
H  -0.684156 -0.274752 -1.155299
H  -4.524419 1.439929 -0.244254
H  -2.024629 0.224382 -3.189168
H  -1.24984 1.767369 -2.856012
H  -3.421066 2.690855 -2.375529
H  -4.129681 1.112455 -2.695251
H  -3.563309 3.852671 0.970804
H  0.708179 3.9341 1.360892
H  -1.486539 4.94088 1.793737
H  1.910725 2.378542 -0.324067
H  4.056702 1.906264 -0.730123
H  1.866489 -2.546282 0.403448
H  6.302133 0.484765 -2.179034
H  7.060322 -0.363746 -0.821073
H  6.67658 1.356411 -0.681035
elementType: Cl F O N C H
totalener: -2054.63915457 hartree
nucrepener: 2650.35536472 hartree
electener: -4704.99451930 hartree
oneelecener: -8093.57578817 hartree
twoeener: 3388.58126887 hartree
cpcmener: -0.04780539 hartree
kineticenergy: 2048.75584952 hartree
xcener: -148.632708472433 hartree
chargesum: -0.0000000
charge: -0.061644 -0.065950 -0.223007 -0.217239 -0.493508 -0.162571 0.112678 -0.307568 0.265023 0.216228 -0.178355 -0.177413 -0.245633 -0.161840 -0.096803 0.107850 -0.183512 0.013336 -0.226136 -0.118391 0.372375 -0.145226 -0.001958 0.007732 0.296708 -0.150379 0.089734 0.086061 0.096732 0.091196 0.090343 0.096303 0.152655 0.145306 0.162007 0.178864 0.168584 0.098234 0.129810 0.113874 0.125501
qa: -0.0616 -0.0660 -0.2230 -0.2172 -0.4935 -0.1626 0.1127 -0.3076 0.2650 0.2162 -0.1784 -0.1774 -0.2456 -0.1618 -0.0968 0.1079 -0.1835 0.0133 -0.2261 -0.1184 0.3724 -0.1452 -0.0020 0.0077 0.2967 -0.1504 0.0897 0.0861 0.0967 0.0912 0.0903 0.0963 0.1527 0.1453 0.1620 0.1789 0.1686 0.0982 0.1298 0.1139 0.1255
va: 1.2631 1.2568 1.0328 1.0588 2.0185 3.2294 3.4064 2.9545 3.7645 3.8850 3.9387 3.9303 3.6428 3.8466 3.7744 3.7399 3.9372 4.0798 4.0126 3.8625 4.1647 3.6147 3.9529 3.9964 4.2606 3.8671 1.0241 1.0222 1.0090 1.0116 1.0120 1.0096 0.9978 1.0057 0.9878 1.0075 0.9963 0.9941 0.9864 1.0066 0.9908
dispcorr: -0.021674812 hartree
energy: -2054.660829385640
dipole: 10.10293 -8.56983 1.53310 32.14344 -27.59528 4.54816 -15.11425 12.34133 -2.77291
magnitude: 5.54303 au
magnitude: 14.08926 debye
