program: Orca
programVersion: 4.2.1
elementType: Cl Cl F F O N N N C C C C C C C C C C C C C C C C C C H H H H H H H H H H H H H H H
charge: 0
multiplicity: 1
keywords: wb97x-d3
keywords: def2-TZVPP
keywords: def2/J RIJCOSX GRIDX6 NOFINALGRIDX
keywords: grid4 nofinalgrid
keywords: scfconv7
keywords: smallprint printgap noloewdin
keywords: NOSOSCF
formula: C18H15Cl2F2N3O
InChI: InChI=1/C18H15Cl2F2N3O/c1-25-7-11(15(24-25)17(21)22)18(26)23-12-4-2-3-8-9-5-6-10(13(8)12)14(9)16(19)20/h2-4,7,9-10,17,23H,5-6H2,1H3
41 atoms
Cl -0.551826 -2.527021 -0.119741
Cl -2.835336 -2.225668 1.631419
F  2.272565 -1.369092 -2.499319
F  3.59367 -2.619102 -1.287929
O  2.907308 1.573904 -1.91624
N  1.144701 2.583358 -0.971715
N  1.75093 -0.800055 1.679542
N  2.405178 -1.554549 0.802273
C  -1.24579 0.516373 -1.044841
C  -3.06654 0.741298 0.306296
C  -2.392875 0.86042 -2.031839
C  -3.633583 1.005065 -1.113775
C  -2.019946 -0.29192 -0.030874
C  -1.022857 1.752594 -0.20297
C  -2.143998 1.8929 0.62054
C  -0.00146 2.682865 -0.15466
C  -2.283222 2.966256 1.474579
C  -1.832053 -1.513774 0.422718
C  -0.131637 3.767665 0.715728
C  -1.257908 3.910072 1.511462
C  2.036053 1.569924 -1.050843
C  1.971879 0.470848 -0.080412
C  2.553806 -0.802017 -0.262696
C  1.455444 0.411594 1.200475
C  3.196451 -1.338341 -1.493917
C  1.310684 -1.351403 2.94189
H  -0.372817 0.055009 -1.497589
H  -3.80597 0.49634 1.063712
H  -2.523411 0.045873 -2.744302
H  -2.171679 1.763202 -2.600063
H  -4.1017 1.986624 -1.177317
H  -4.390997 0.259597 -1.356418
H  -3.157541 3.076551 2.102676
H  0.665568 4.497663 0.773386
H  -1.330383 4.758392 2.178949
H  1.339804 3.371402 -1.575011
H  0.93963 1.138116 1.805891
H  4.05337 -0.763816 -1.836271
H  1.806576 -2.303105 3.097628
H  0.23364 -1.507703 2.936701
H  1.568394 -0.678888 3.755364
elementType: Cl F O N C H
totalener: -2054.63515764 hartree
nucrepener: 2856.82258158 hartree
electener: -4911.45773921 hartree
oneelecener: -8505.12739309 hartree
twoeener: 3593.66965387 hartree
cpcmener: -0.03865125 hartree
kineticenergy: 2048.77563169 hartree
xcener: -148.641617269140 hartree
chargesum: 0.0000000
charge: -0.058915 -0.067752 -0.218877 -0.216110 -0.530383 -0.133586 0.125655 -0.295717 0.300134 0.221914 -0.183044 -0.183543 -0.229782 -0.215074 -0.102668 0.069258 -0.157817 0.013196 -0.181973 -0.126596 0.352269 -0.084874 -0.041574 -0.060336 0.306418 -0.147993 0.082297 0.085905 0.099897 0.092258 0.090811 0.098245 0.152877 0.146747 0.163602 0.178587 0.183425 0.111713 0.117484 0.109832 0.134090
qa: -0.0589 -0.0678 -0.2189 -0.2161 -0.5304 -0.1336 0.1257 -0.2957 0.3001 0.2219 -0.1830 -0.1835 -0.2298 -0.2151 -0.1027 0.0693 -0.1578 0.0132 -0.1820 -0.1266 0.3523 -0.0849 -0.0416 -0.0603 0.3064 -0.1480 0.0823 0.0859 0.0999 0.0923 0.0908 0.0982 0.1529 0.1467 0.1636 0.1786 0.1834 0.1117 0.1175 0.1098 0.1341
va: 1.2736 1.2494 1.0374 1.0608 1.9777 3.1924 3.3744 2.9082 3.7255 3.8817 3.9531 3.9406 3.5863 3.7781 3.7821 3.6659 3.9334 4.0070 3.9789 3.8701 4.2389 3.3821 3.9690 4.0063 4.2143 3.8684 1.0222 1.0240 1.0072 1.0117 1.0118 1.0089 0.9973 1.0059 0.9868 1.0136 0.9874 0.9948 1.0061 0.9950 0.9927
dispcorr: -0.027676261 hartree
energy: -2054.662833898518
dipole: -11.33539 8.77226 -2.56313 25.10931 -22.38932 2.71999 6.13447 -3.73542 2.39905
magnitude: 4.44110 au
magnitude: 11.28839 debye
