program: Orca
programVersion: 4.2.1
elementType: Cl Cl F F O N N N C C C C C C C C C C C C C C C C C C H H H H H H H H H H H H H H H
charge: 0
multiplicity: 1
keywords: wb97x-d3
keywords: def2-TZVPP
keywords: def2/J RIJCOSX GRIDX6 NOFINALGRIDX
keywords: grid4 nofinalgrid
keywords: scfconv7
keywords: smallprint printgap noloewdin
keywords: NOSOSCF
formula: C18H15Cl2F2N3O
InChI: InChI=1/C18H15Cl2F2N3O/c1-25-7-11(15(24-25)17(21)22)18(26)23-12-4-2-3-8-9-5-6-10(13(8)12)14(9)16(19)20/h2-4,7,9-10,17,23H,5-6H2,1H3
41 atoms
Cl -2.826804 -2.479806 1.12322
Cl -5.286201 -0.95122 1.094872
F  3.115444 -2.982168 -1.469628
F  4.450884 -1.767278 -2.689575
O  1.285456 0.542919 -1.388877
N  1.102689 1.262429 0.748328
N  4.978425 -0.366282 1.028565
N  4.942494 -1.157911 -0.034049
C  -1.587389 0.06381 -0.487433
C  -3.519511 1.270773 -0.508571
C  -1.870821 0.281751 -1.99921
C  -3.190514 1.094241 -2.012914
C  -3.010071 -0.05277 0.006907
C  -1.262553 1.418114 0.097579
C  -2.450001 2.160633 0.076823
C  -0.106969 1.973907 0.618076
C  -2.509971 3.452224 0.554077
C  -3.621674 -1.024126 0.652009
C  -0.166707 3.279065 1.117809
C  -1.345797 4.004656 1.08663
C  1.746368 0.631561 -0.259412
C  3.053224 0.056267 0.089735
C  3.78834 -0.914906 -0.620204
C  3.876659 0.378551 1.152069
C  3.400974 -1.69444 -1.826738
C  6.136313 -0.338794 1.897435
H  -0.906246 -0.748971 -0.255485
H  -4.545885 1.548898 -0.285354
H  -1.99684 -0.681317 -2.494226
H  -1.046493 0.799088 -2.483114
H  -3.095673 2.056454 -2.515183
H  -3.990508 0.541179 -2.505303
H  -3.434009 4.015511 0.540047
H  0.725143 3.72244 1.543053
H  -1.358955 5.00942 1.487494
H  1.579795 1.371063 1.630072
H  3.770073 1.088297 1.957262
H  2.543008 -1.285797 -2.352724
H  5.843515 -0.560766 2.920356
H  6.611872 0.638378 1.863321
H  6.840375 -1.090268 1.557346
elementType: Cl F O N C H
totalener: -2054.63954710 hartree
nucrepener: 2616.04497605 hartree
electener: -4670.68452315 hartree
oneelecener: -8024.25096913 hartree
twoeener: 3353.56644597 hartree
cpcmener: -0.04265096 hartree
kineticenergy: 2048.75304237 hartree
xcener: -148.632580590752 hartree
chargesum: -0.0000000
charge: -0.064234 -0.064009 -0.223932 -0.220526 -0.527869 -0.170761 0.114706 -0.309400 0.270389 0.229937 -0.194814 -0.179203 -0.235827 -0.160525 -0.113236 0.130499 -0.183629 0.010854 -0.227441 -0.117436 0.406897 -0.111549 -0.009054 -0.007294 0.260138 -0.151662 0.090756 0.085307 0.096167 0.093466 0.091387 0.096703 0.152276 0.145460 0.162148 0.179731 0.169959 0.113910 0.129885 0.129606 0.112218
qa: -0.0642 -0.0640 -0.2239 -0.2205 -0.5279 -0.1708 0.1147 -0.3094 0.2704 0.2299 -0.1948 -0.1792 -0.2358 -0.1605 -0.1132 0.1305 -0.1836 0.0109 -0.2274 -0.1174 0.4069 -0.1115 -0.0091 -0.0073 0.2601 -0.1517 0.0908 0.0853 0.0962 0.0935 0.0914 0.0967 0.1523 0.1455 0.1621 0.1797 0.1700 0.1139 0.1299 0.1296 0.1122
va: 1.2603 1.2593 1.0390 1.0499 1.9840 3.2485 3.4062 2.9724 3.7563 3.8383 3.9065 3.9181 3.6395 3.8596 3.7806 3.7108 3.9417 4.0721 3.9963 3.8667 4.1025 3.5811 3.9223 4.0035 4.2216 3.8652 1.0291 1.0237 1.0072 1.0328 1.0124 1.0093 0.9985 1.0034 0.9880 1.0077 0.9964 1.0072 0.9879 0.9878 1.0082
dispcorr: -0.021350525 hartree
energy: -2054.660897621658
dipole: 10.86405 -9.93697 0.92708 24.36364 -21.53488 2.82876 1.48271 1.35759 2.84030
magnitude: 4.11444 au
magnitude: 10.45808 debye
