program: Orca
programVersion: 4.2.1
elementType: Cl Cl F F O N N N C C C C C C C C C C C C C C C C C C H H H H H H H H H H H H H H H
charge: 0
multiplicity: 1
keywords: wb97x-d3
keywords: def2-TZVPP
keywords: def2/J RIJCOSX GRIDX6 NOFINALGRIDX
keywords: grid4 nofinalgrid
keywords: scfconv7
keywords: smallprint printgap noloewdin
keywords: NOSOSCF
formula: C18H15Cl2F2N3O
InChI: InChI=1/C18H15Cl2F2N3O/c1-25-7-11(15(24-25)17(21)22)18(26)23-12-4-2-3-8-9-5-6-10(13(8)12)14(9)16(19)20/h2-4,7,9-10,17,23H,5-6H2,1H3
41 atoms
Cl -3.185386 -2.16177 1.333255
Cl -5.021559 -0.679272 -0.344978
F  3.558711 -3.046811 -0.767333
F  1.757413 -2.666631 0.413976
O  2.339866 -0.541802 2.643636
N  0.955805 1.14799 2.102841
N  3.323211 0.83592 -1.475812
N  3.544933 -0.473452 -1.389663
C  -0.907963 -0.268529 -0.008886
C  -2.344387 0.90585 -1.331834
C  -0.378998 -0.524006 -1.446648
C  -1.355469 0.275374 -2.34519
C  -2.387034 -0.205272 -0.309486
C  -0.693053 1.194333 0.298901
C  -1.564732 1.915299 -0.523496
C  0.131326 1.852236 1.193875
C  -1.615694 3.292513 -0.484155
C  -3.39125 -0.9157 0.160166
C  0.070885 3.246357 1.250051
C  -0.786091 3.953729 0.421301
C  1.910537 0.240977 1.80194
C  2.47032 0.256991 0.446391
C  3.040332 -0.837203 -0.231469
C  2.677806 1.320045 -0.409817
C  3.045669 -2.259003 0.209073
C  3.802868 1.593485 -2.611908
H  -0.571788 -0.98186 0.738397
H  -3.284372 1.252651 -1.751954
H  -0.418191 -1.589882 -1.669394
H  0.65314 -0.203019 -1.558183
H  -0.858192 1.03866 -2.942761
H  -1.891079 -0.382978 -3.028894
H  -2.294331 3.849155 -1.117209
H  0.697839 3.775227 1.95625
H  -0.81653 5.032989 0.488814
H  0.693087 1.195129 3.079128
H  2.43791 2.367181 -0.323102
H  3.604778 -2.435212 1.125695
H  4.693282 2.159081 -2.348289
H  3.030968 2.277996 -2.951107
H  4.04068 0.903791 -3.414235
elementType: Cl F O N C H
totalener: -2054.63563503 hartree
nucrepener: 2765.44176541 hartree
electener: -4820.07740043 hartree
oneelecener: -8322.32177384 hartree
twoeener: 3502.24437341 hartree
cpcmener: -0.04036699 hartree
kineticenergy: 2048.76026859 hartree
xcener: -148.636022071077 hartree
chargesum: 0.0000000
charge: -0.062531 -0.061224 -0.213682 -0.215735 -0.521506 -0.150328 0.119513 -0.299852 0.342192 0.233646 -0.206956 -0.179952 -0.274114 -0.137920 -0.124646 0.019485 -0.163521 0.013710 -0.200225 -0.103314 0.319977 -0.135545 -0.024379 -0.010602 0.309084 -0.148870 0.094131 0.086716 0.100967 0.093054 0.091560 0.099728 0.152759 0.149561 0.161946 0.181978 0.182081 0.112827 0.131147 0.123055 0.115786
qa: -0.0625 -0.0612 -0.2137 -0.2157 -0.5215 -0.1503 0.1195 -0.2999 0.3422 0.2336 -0.2070 -0.1800 -0.2741 -0.1379 -0.1246 0.0195 -0.1635 0.0137 -0.2002 -0.1033 0.3200 -0.1355 -0.0244 -0.0106 0.3091 -0.1489 0.0941 0.0867 0.1010 0.0931 0.0916 0.0997 0.1528 0.1496 0.1619 0.1820 0.1821 0.1128 0.1311 0.1231 0.1158
va: 1.2620 1.2621 1.0643 1.0424 1.9854 3.1688 3.3843 2.9265 3.6870 3.8523 3.9511 3.9446 3.6732 3.7859 3.8236 3.6922 3.9262 4.0740 3.9643 3.8549 4.2637 3.4906 3.9387 3.9727 4.2073 3.8650 1.0324 1.0228 1.0161 1.0075 1.0121 1.0101 0.9977 1.0055 0.9864 1.0102 0.9903 0.9917 0.9865 0.9919 1.0067
dispcorr: -0.025787560 hartree
energy: -2054.661422586071
dipole: 15.58246 -15.46051 0.12195 26.18350 -22.02459 4.15891 -13.80930 12.02084 -1.78846
magnitude: 4.52880 au
magnitude: 11.51129 debye
