program: Orca
programVersion: 4.2.1
elementType: Cl Cl F F O N N N C C C C C C C C C C C C C C C C C C H H H H H H H H H H H H H H H
charge: 0
multiplicity: 1
keywords: wb97x-d3
keywords: def2-TZVPP
keywords: def2/J RIJCOSX GRIDX6 NOFINALGRIDX
keywords: grid4 nofinalgrid
keywords: scfconv7
keywords: smallprint printgap noloewdin
keywords: NOSOSCF
formula: C18H15Cl2F2N3O
InChI: InChI=1/C18H15Cl2F2N3O/c1-25-7-11(15(24-25)17(21)22)18(26)23-12-4-2-3-8-9-5-6-10(13(8)12)14(9)16(19)20/h2-4,7,9-10,17,23H,5-6H2,1H3
41 atoms
Cl -2.680029 -2.763043 -0.052194
Cl -5.180214 -1.321329 0.184414
F  2.94963 0.151806 2.767454
F  3.642905 -1.91829 2.735985
O  1.389862 0.784191 -1.800738
N  1.145174 1.075706 0.435035
N  5.067195 -0.874991 -0.788572
N  4.789769 -1.240239 0.457261
C  -1.491258 0.085571 -1.091876
C  -3.45557 1.222465 -0.90015
C  -1.759718 0.603624 -2.531113
C  -3.095414 1.378288 -2.399498
C  -2.917444 -0.166262 -0.661316
C  -1.213291 1.296473 -0.230667
C  -2.422178 1.99446 -0.117107
C  -0.08313 1.762565 0.419711
C  -2.532718 3.151276 0.623836
C  -3.509822 -1.263548 -0.238415
C  -0.192912 2.931603 1.180672
C  -1.394241 3.611956 1.282662
C  1.80543 0.626463 -0.663188
C  3.077404 -0.063227 -0.40752
C  3.591666 -0.757674 0.710027
C  4.077235 -0.179696 -1.35247
C  2.943777 -1.005906 2.026737
C  6.330748 -1.226589 -1.401001
H  -0.792365 -0.741955 -1.020465
H  -4.492764 1.422872 -0.646279
H  -1.863382 -0.241325 -3.211954
H  -0.940058 1.221254 -2.889138
H  -3.01093 2.427773 -2.67957
H  -3.874316 0.932541 -3.017982
H  -3.475635 3.674311 0.714096
H  0.677742 3.303911 1.706664
H  -1.444013 4.506726 1.888515
H  1.681815 1.183385 1.2825
H  4.143232 0.193342 -2.361193
H  1.909569 -1.341384 1.944116
H  6.162205 -1.803356 -2.306885
H  6.900355 -1.825179 -0.698515
H  6.894561 -0.329637 -1.645307
elementType: Cl F O N C H
totalener: -2054.63808443 hartree
nucrepener: 2638.58808270 hartree
electener: -4693.22616714 hartree
oneelecener: -8069.00815116 hartree
twoeener: 3375.78198402 hartree
cpcmener: -0.03407240 hartree
kineticenergy: 2048.74194638 hartree
xcener: -148.630022746266 hartree
chargesum: 0.0000000
charge: -0.063576 -0.063994 -0.220918 -0.204139 -0.514702 -0.207237 0.113891 -0.310289 0.272322 0.234918 -0.196700 -0.180178 -0.237926 -0.180493 -0.106911 0.134675 -0.193947 0.008816 -0.222864 -0.112198 0.402165 -0.114807 0.024311 -0.035655 0.242290 -0.153069 0.091748 0.084728 0.097267 0.093997 0.091661 0.097440 0.151630 0.141044 0.162209 0.192788 0.179910 0.129982 0.129199 0.112005 0.130610
qa: -0.0636 -0.0640 -0.2209 -0.2041 -0.5147 -0.2072 0.1139 -0.3103 0.2723 0.2349 -0.1967 -0.1802 -0.2379 -0.1805 -0.1069 0.1347 -0.1939 0.0088 -0.2229 -0.1122 0.4022 -0.1148 0.0243 -0.0357 0.2423 -0.1531 0.0917 0.0847 0.0973 0.0940 0.0917 0.0974 0.1516 0.1410 0.1622 0.1928 0.1799 0.1300 0.1292 0.1120 0.1306
va: 1.2608 1.2594 1.0294 1.0789 1.9953 3.2189 3.4175 2.9586 3.7722 3.8333 3.9075 3.9157 3.6442 3.9049 3.7763 3.7263 3.9469 4.0722 3.9863 3.8805 4.1098 3.5583 3.9054 4.0331 4.2229 3.8646 1.0297 1.0240 1.0072 1.0327 1.0121 1.0093 0.9991 1.0061 0.9876 1.0201 0.9991 0.9797 0.9881 1.0084 0.9872
dispcorr: -0.021814189 hartree
energy: -2054.659898622455
dipole: 12.36592 -11.08709 1.27883 18.91839 -17.92471 0.99368 -17.43840 16.35130 -1.08710
magnitude: 1.95054 au
magnitude: 4.95787 debye
