program: Gaussian 09
title: 000069350
version: EM64L-G09RevD.01
frameworkgroup: C1[X(C14H28O2)]
method: RPBEPBE
basis: SDD
operation: Freq
keyword: #pfreq=noraman
keyword: PBEPBE/SDD
title: #p freq=noraman PBEPBE/SDD
converged: YES YES NO NO
title: Mulliken charges:
elementType: O O C C C C C C C C C C C C C C H H H H H H H H H H H H H H H H H H H H H H H H H H H H
charge: -0.264182 -0.243972 -0.366788 -0.344626 -0.348810 -0.415473 -0.362942 -0.381278 -0.343006 -0.353968 -0.323948 -0.503857 -0.357808 0.256483 -0.698084 -0.692565 0.185479 0.188096 0.204992 0.192911 0.185635 0.191038 0.205630 0.236701 0.196500 0.200857 0.202859 0.218797 0.182561 0.186615 0.195137 0.193843 0.216041 0.237071 0.231437 0.228962 0.198714 0.195134 0.209902 0.215971 0.211966 0.206246 0.215620 0.210104
chargesum: 0.00000
title: Mulliken charges with hydrogens summed into heavy atoms:
elementType: O O C C C C C C C C C C C C C C
charge: -0.264182 -0.243972 0.006787 0.053277 0.027863 0.026858 0.034416 0.040378 0.026171 0.035012 0.129165 -0.043458 0.036041 0.256483 -0.060245 -0.060595
polarizability: 1.77791389e+02 5.76714468e-01 1.61477596e+02 -2.42455158e+00 -1.07527736e+00 1.32581344e+02
1716.lowfreq: -24.0278 -11.7178 -0.0005 0.0002 0.0006 4.7935 12.2742 17.7093 29.7810
frequency: -19.9689 16.2862 29.4782 41.6821 53.9948 62.8865 71.0586 84.3224 102.6813 107.1123 119.4331 133.7598 142.1599 166.2010 188.6524 220.9220 224.7023 230.9670 257.5330 289.2518 324.9546 352.2523 366.0198 406.9184 429.2479 474.1496 514.0407 593.3146 649.9139 719.7099 723.6754 727.7770 747.7855 755.1085 790.9938 830.5116 856.7407 864.5292 874.0683 887.4681 897.7911 920.1963 954.0273 983.5687 998.6142 1005.3045 1020.1443 1033.3223 1051.8794 1057.7019 1075.2565 1076.8994 1084.4307 1098.9160 1111.5215 1120.6872 1148.1035 1173.6227 1195.1572 1202.8387 1213.9050 1220.0134 1243.2434 1255.8930 1258.5537 1259.4066 1279.1946 1283.0057 1284.8576 1290.4305 1292.2407 1299.0980 1313.4578 1320.1478 1336.5597 1347.5128 1352.5381 1358.2239 1361.0401 1365.1910 1385.6651 1388.4955 1446.1366 1450.8759 1456.1959 1457.7801 1460.8215 1463.9466 1464.2707 1470.1445 1471.8190 1475.0678 1477.0736 1478.9663 1482.6063 1486.8397 1488.3525 1636.7116 2947.0325 2949.5078 2951.5270 2959.5950 2963.8761 2966.6521 2967.7339 2969.3792 2970.2817 2976.6953 2983.8604 2984.8068 2988.2305 3000.6219 3003.9459 3007.6768 3018.7584 3023.1489 3026.9588 3031.7317 3050.0215 3052.3367 3063.8249 3066.3384 3069.9536 3070.4655 3081.1879 3099.3927
redmass: 2.0422 2.6878 4.1468 2.9832 6.3281 1.7019 2.7992 3.3761 2.2552 2.3532 2.6457 2.3922 2.0131 2.3244 3.2171 1.9532 1.4265 1.1188 3.0412 2.3916 2.7774 3.7855 3.1521 2.5636 2.8594 3.3102 2.9678 3.7100 2.4331 1.0950 1.1209 1.3847 1.6595 1.2583 1.4199 1.3961 2.4441 1.6418 1.7741 1.8312 1.8275 1.5874 1.4153 1.7575 2.4579 1.9141 3.2103 2.1102 2.1418 2.7375 2.3801 2.3487 2.0296 2.1125 2.1547 2.4485 1.9666 2.0207 1.5984 1.4675 1.8269 1.2926 1.3190 1.2866 1.3083 1.2786 1.1247 1.0906 1.0821 1.1391 1.1433 1.2047 1.3215 1.2926 1.4075 1.5347 1.6514 1.4398 1.4757 1.5040 1.2167 1.2178 1.0871 1.0983 1.0776 1.0656 1.0797 1.0728 1.0745 1.0716 1.0663 1.0483 1.0544 1.0730 1.0767 1.0933 1.0839 9.5541 1.0588 1.0589 1.0592 1.0593 1.0603 1.0590 1.0604 1.0374 1.0363 1.0636 1.0960 1.0645 1.0946 1.0988 1.0621 1.1000 1.0921 1.0702 1.1024 1.0977 1.1016 1.1029 1.1006 1.1004 1.0994 1.0992 1.0996 1.1080
irintensity: 0.0696 0.1618 0.1979 0.1318 1.3349 0.1796 0.1177 0.4250 0.4036 0.3651 0.0690 0.2123 0.2972 1.8602 2.3122 0.5372 0.4184 0.0135 0.3407 3.1470 5.2087 3.7305 1.7102 1.2478 2.2035 1.2630 3.4754 3.9425 2.7580 28.1713 3.4870 2.3049 5.5504 2.4576 3.3975 1.5246 6.0393 1.1838 12.4130 2.4804 5.6889 7.7673 14.3250 31.6219 0.4541 6.5627 10.6427 6.9387 81.7135 2.2139 6.1105 1.4880 6.2325 39.6871 8.8887 8.8435 7.8494 43.0048 2.2100 3.0955 87.0468 19.3769 2.7895 8.9386 9.8874 6.1571 1.3705 0.7103 0.1119 0.3019 1.7117 1.2386 4.2789 0.4885 0.5028 2.2075 0.9026 1.2550 1.2217 0.6362 3.4260 20.5211 15.7130 14.6676 4.1411 4.0755 1.4689 3.1527 2.7326 1.3287 2.0791 19.7516 1.0513 6.8406 6.2462 4.1669 39.3251 175.2808 0.2570 4.9891 14.7515 0.2366 15.4324 18.7523 130.0466 20.8090 55.1161 42.6344 0.0339 50.6539 1.9226 4.0001 26.9293 2.7901 5.4614 57.3882 67.4489 21.7765 155.7720 10.5571 223.4577 9.9253 4.9834 91.4391 33.7679 19.1483
temp: 298.150 k
press: 1.00000 atm
elementType: 8 8 6 6 6 6 6 6 6 6 6 6 6 6 6 6 1 1 1 1 1 1 1 1 1 1 1 1 1 1 1 1 1 1 1 1 1 1 1 1 1 1 1 1
symmnumber: 1
zpe: 1036349.3 jmol-1
zpe.correction: 0.394725 hartree
zpe.thermalcorrener: 0.414804 hartree
zpe.thermalcorrenthalpy: 0.415748 hartree
zpe.thermalcorrgfe: 0.343438 hartree
zpe.sumelectzpe: -699.413394 hartree
zpe.sumelectthermal: -699.393314 hartree
zpe.sumelectthermalent: -699.392370 hartree
zpe.sumelectthermalfe: -699.464680 hartree
dipole: 1.3437 -0.0448 -1.5111
dipole: 2.0226
quadrupole: -109.6936 -93.1586 -107.1573
quadrupole: -2.7180 7.6994 1.0089
quadrupole: -6.3571 10.1779 -3.8208 -2.7180 7.6994 1.0089
hfenergy: -699.8081184 hartree
pointgroup: C01 [X(C14H28O2)]
dipole: -0.5342688 0.0189769 0.5894273 debye
polarizability: 177.4652749|-2.4488174|161.6672778|-1.8339737|2.6812579|132.717776 unknown
InChI: InChI=1S/C14H28O2/c1-3-5-7-9-11-13-16-14(15)12-10-8-6-4-2/h3-13H2,1-2H3
charge 0 multiplicity 1
44 atoms
O  2.500349 -1.233226 0.722719
O  3.483857 -0.768163 -1.341773
C  -1.717453 -1.728096 -0.495539
C  -0.423017 -1.944629 0.319668
C  -2.858648 -1.093554 0.331043
C  0.744199 -2.482564 -0.538223
C  1.096585 1.908274 -0.118763
C  2.159729 1.651249 0.972532
C  -0.201093 2.532885 0.441365
C  -4.145695 -0.847757 -0.488737
C  2.078473 -2.577148 0.216508
C  3.441748 0.960843 0.433699
C  -1.289598 2.746741 -0.635405
C  3.167927 -0.401926 -0.185752
C  -5.266562 -0.176076 0.333517
C  -2.589654 3.353514 -0.064678
H  -1.493459 -1.073913 -1.364981
H  -2.060115 -2.696159 -0.91761
H  -0.117919 -0.985145 0.782378
H  -0.623544 -2.64478 1.157411
H  -2.506684 -0.128219 0.753102
H  -3.094561 -1.743964 1.199463
H  0.497966 -3.497171 -0.914665
H  0.886807 -1.843675 -1.430935
H  1.5193 2.56845 -0.904126
H  0.846355 0.950868 -0.621273
H  2.45048 2.61305 1.440045
H  1.725998 1.020863 1.771472
H  -0.605242 1.8774 1.241874
H  0.032582 3.504795 0.924693
H  -4.50984 -1.813449 -0.895246
H  -3.901047 -0.214104 -1.366108
H  1.991758 -3.181535 1.135013
H  2.877948 -2.97414 -0.434067
H  4.160688 0.8252 1.264619
H  3.927673 1.578589 -0.34116
H  -0.889562 3.404446 -1.433771
H  -1.516214 1.773891 -1.118855
H  -5.549631 -0.798378 1.203654
H  -6.175017 -0.013579 -0.275291
H  -4.937702 0.808272 0.718159
H  -3.02772 2.692332 0.707523
H  -3.349998 3.501165 -0.853606
H  -2.39585 4.335621 0.406805
