program: Orca
programVersion: 4.2.1
elementType: Cl Cl F F O N N N C C C C C C C C C C C C C C C C C C H H H H H H H H H H H H H H H
charge: 0
multiplicity: 1
keywords: wb97x-d3
keywords: def2-TZVPP
keywords: def2/J RIJCOSX GRIDX6 NOFINALGRIDX
keywords: grid4 nofinalgrid
keywords: scfconv7
keywords: smallprint printgap noloewdin
keywords: NOSOSCF
formula: C18H15Cl2F2N3O
InChI: InChI=1/C18H15Cl2F2N3O/c1-25-7-11(15(24-25)17(21)22)18(26)23-12-4-2-3-8-9-5-6-10(13(8)12)14(9)16(19)20/h2-4,7,9-10,17,23H,5-6H2,1H3
41 atoms
Cl -0.587253 -2.532095 -0.079733
Cl -2.897679 -2.209312 1.633023
F  2.314424 -1.373759 -2.510616
F  3.639905 -2.603462 -1.281418
O  2.908242 1.582752 -1.907271
N  1.137001 2.578807 -0.965664
N  1.747665 -0.819309 1.669262
N  2.409391 -1.562822 0.790595
C  -1.256697 0.512379 -1.035117
C  -3.087983 0.75442 0.298295
C  -2.393654 0.855383 -2.034564
C  -3.641331 1.01285 -1.128231
C  -2.043548 -0.286712 -0.022774
C  -1.034586 1.752126 -0.198994
C  -2.161453 1.902679 0.615362
C  -0.009651 2.679054 -0.150848
C  -2.30108 2.981698 1.462865
C  -1.867384 -1.507058 0.440306
C  -0.138735 3.765937 0.718027
C  -1.269464 3.91849 1.505089
C  2.037725 1.570453 -1.046201
C  1.977368 0.468072 -0.077191
C  2.564994 -0.801756 -0.267118
C  1.457534 0.398398 1.201758
C  3.225373 -1.328861 -1.494439
C  1.354374 -1.3699 2.945829
H  -0.381954 0.045009 -1.47783
H  -3.835948 0.517847 1.050315
H  -2.52184 0.03656 -2.743019
H  -2.16308 1.752941 -2.607974
H  -4.104631 1.996428 -1.203324
H  -4.40182 0.270675 -1.372802
H  -3.180063 3.100877 2.083589
H  0.663372 4.490946 0.779122
H  -1.341627 4.769705 2.169495
H  1.324151 3.359829 -1.580838
H  0.939826 1.121261 1.810302
H  4.078186 -0.740432 -1.826491
H  1.778304 -2.364813 3.035729
H  0.270131 -1.437998 3.016976
H  1.72572 -0.749816 3.758838
elementType: Cl F O N C H
totalener: -2054.64488009 hartree
nucrepener: 2849.98172098 hartree
electener: -4904.62660107 hartree
oneelecener: -8491.39331546 hartree
twoeener: 3586.76671439 hartree
cpcmener: -0.03232356 hartree
kineticenergy: 2048.75821344 hartree
xcener: -148.636761011959 hartree
chargesum: -0.0000000
charge: -0.055424 -0.067859 -0.217160 -0.213982 -0.497118 -0.139857 0.128462 -0.295364 0.299162 0.217322 -0.183938 -0.184093 -0.232462 -0.207320 -0.104060 0.061849 -0.154799 0.016225 -0.180279 -0.124397 0.338422 -0.092066 -0.036090 -0.060708 0.306576 -0.154663 0.085383 0.085374 0.100189 0.091914 0.090290 0.098019 0.150259 0.144527 0.160376 0.174863 0.180478 0.108592 0.117704 0.111346 0.134307
qa: -0.0554 -0.0679 -0.2172 -0.2140 -0.4971 -0.1399 0.1285 -0.2954 0.2992 0.2173 -0.1839 -0.1841 -0.2325 -0.2073 -0.1041 0.0618 -0.1548 0.0162 -0.1803 -0.1244 0.3384 -0.0921 -0.0361 -0.0607 0.3066 -0.1547 0.0854 0.0854 0.1002 0.0919 0.0903 0.0980 0.1503 0.1445 0.1604 0.1749 0.1805 0.1086 0.1177 0.1113 0.1343
va: 1.2763 1.2492 1.0402 1.0636 2.0188 3.1808 3.3662 2.9024 3.7248 3.8858 3.9534 3.9376 3.5860 3.7705 3.7895 3.6764 3.9365 4.0115 3.9828 3.8791 4.2545 3.3974 3.9643 4.0002 4.2191 3.8678 1.0218 1.0243 1.0074 1.0119 1.0118 1.0091 0.9980 1.0070 0.9880 1.0161 0.9886 0.9947 1.0074 0.9932 0.9916
dispcorr: -0.027487340 hartree
energy: -2054.672367433147
dipole: -11.12960 8.70911 -2.42049 25.04489 -22.45659 2.58830 6.01803 -3.76032 2.25772
magnitude: 4.20183 au
magnitude: 10.68020 debye
