program: Orca
programVersion: 4.2.1
elementType: Cl Cl F F O N N N C C C C C C C C C C C C C C C C C C H H H H H H H H H H H H H H H
charge: 0
multiplicity: 1
keywords: wb97x-d3
keywords: def2-TZVPP
keywords: def2/J RIJCOSX GRIDX6 NOFINALGRIDX
keywords: grid4 nofinalgrid
keywords: scfconv7
keywords: smallprint printgap noloewdin
keywords: NOSOSCF
formula: C18H15Cl2F2N3O
InChI: InChI=1/C18H15Cl2F2N3O/c1-25-7-11(15(24-25)17(21)22)18(26)23-12-4-2-3-8-9-5-6-10(13(8)12)14(9)16(19)20/h2-4,7,9-10,17,23H,5-6H2,1H3
41 atoms
Cl -2.417441 -2.50164 1.874345
Cl -4.922237 -1.050447 1.833381
F  3.723652 1.431315 -2.173726
F  2.892882 -0.471759 -2.834912
O  0.90817 -0.301838 1.328228
N  1.208074 1.023883 -0.488023
N  4.839651 -1.421148 0.878796
N  5.059767 -1.04108 -0.369892
C  -1.580907 -0.495303 -0.553966
C  -3.551243 0.639167 -0.576703
C  -2.112407 -0.718903 -1.996167
C  -3.459504 0.05239 -2.01218
C  -2.893855 -0.480393 0.188397
C  -1.242624 0.973793 -0.455364
C  -2.454035 1.670438 -0.476811
C  -0.045061 1.664748 -0.457086
C  -2.501457 3.047504 -0.504113
C  -3.344579 -1.240708 1.164386
C  -0.089014 3.061392 -0.465773
C  -1.294639 3.741228 -0.49459
C  1.612017 0.098886 0.426476
C  2.994585 -0.408582 0.280188
C  3.961725 -0.423507 -0.752126
C  3.619056 -1.076538 1.30964
C  3.922946 0.076349 -2.149092
C  5.853395 -2.158612 1.590153
H  -0.829137 -1.200781 -0.219556
H  -4.543735 0.955398 -0.265698
H  -2.267754 -1.783729 -2.172875
H  -1.404544 -0.359967 -2.742952
H  -3.492502 0.837648 -2.767224
H  -4.297398 -0.621045 -2.196113
H  -3.44458 3.57806 -0.530405
H  0.839206 3.619381 -0.437768
H  -1.292552 4.823138 -0.49771
H  1.9117 1.463988 -1.05755
H  3.256688 -1.31006 2.297253
H  4.858717 -0.136461 -2.669038
H  5.980342 -3.148337 1.15678
H  5.555355 -2.261814 2.629114
H  6.799298 -1.625957 1.543402
totalener: -2054.62480594 hartree
nucrepener: 2655.82123681 hartree
electener: -4710.44604275 hartree
oneelecener: -8103.39915820 hartree
twoeener: 3392.95311545 hartree
kineticenergy: 2048.78099401 hartree
xcener: -148.630465165542 hartree
chargesum: 0.0000000
charge: -0.046565 -0.062117 -0.217191 -0.190765 -0.392395 -0.216367 0.089752 -0.263820 0.263278 0.198964 -0.185767 -0.187472 -0.260205 -0.139445 -0.101255 0.135932 -0.156549 0.044512 -0.195807 -0.084462 0.340250 -0.163623 0.005432 -0.033216 0.313829 -0.145653 0.090133 0.079670 0.091967 0.088596 0.085699 0.092534 0.120386 0.108617 0.122622 0.171344 0.162297 0.097707 0.120977 0.097270 0.120910
qa: -0.0466 -0.0621 -0.2172 -0.1908 -0.3924 -0.2164 0.0898 -0.2638 0.2633 0.1990 -0.1858 -0.1875 -0.2602 -0.1394 -0.1013 0.1359 -0.1565 0.0445 -0.1958 -0.0845 0.3402 -0.1636 0.0054 -0.0332 0.3138 -0.1457 0.0901 0.0797 0.0920 0.0886 0.0857 0.0925 0.1204 0.1086 0.1226 0.1713 0.1623 0.0977 0.1210 0.0973 0.1209
va: 1.2773 1.2601 1.0620 1.0916 2.1135 3.2064 3.4067 2.9226 3.7733 3.8975 3.9358 3.9230 3.7146 3.9653 3.8745 3.7996 3.9982 4.0818 4.0670 3.9645 4.1818 3.7158 4.0099 4.0517 4.1949 3.8920 1.0301 1.0255 1.0106 1.0154 1.0143 1.0111 1.0064 1.0160 1.0007 1.0458 1.0065 1.0000 0.9906 0.9992 0.9966
dispcorr: -0.021853994 hartree
energy: -2054.646659934603
dipole: 10.66485 -8.93597 1.72888 7.32445 -7.31833 0.00612 -7.24120 7.00093 -0.24028
magnitude: 1.74551 au
magnitude: 4.43674 debye
