program: Orca
programVersion: 4.2.1
elementType: I O N C C C C C C C C C C C C C H H H H H H H H H H
elementType: I
charge: 0
multiplicity: 1
keywords: wb97x-d3
keywords: def2-TZVPP
keywords: def2/J RIJCOSX GRIDX6 NOFINALGRIDX
keywords: grid4 nofinalgrid
keywords: scfconv7
keywords: smallprint printgap noloewdin
keywords: NOSOSCF
formula: C13H10INO
InChI: InChI=1/C13H10INO/c14-12-9-5-4-8-11(12)13(16)15-10-6-2-1-3-7-10/h1-9,15H
26 atoms
I  -0.44061 -1.767977 0.105925
O  -1.06333 0.992062 -2.874385
N  0.889306 0.916217 -1.769273
C  -1.207864 1.131702 -0.527042
C  1.758944 0.944456 -0.663618
C  -0.45749 0.99559 -1.812108
C  -1.31305 0.118298 0.41989
C  -1.884379 2.33046 -0.311355
C  1.570708 1.795101 0.421366
C  2.87687 0.114308 -0.698695
C  -2.0439 0.313952 1.584247
C  -2.606125 2.535559 0.85187
C  2.468173 1.770436 1.479111
C  3.781225 0.114969 0.350484
C  -2.677588 1.52827 1.803005
C  3.573953 0.93293 1.453147
H  1.322119 0.705495 -2.659632
H  -1.820378 3.117223 -1.052143
H  0.742502 2.488083 0.44868
H  3.033391 -0.539585 -1.547768
H  -2.126745 -0.471624 2.322457
H  -3.110682 3.478066 1.013908
H  2.305936 2.429324 2.321767
H  4.645388 -0.534565 0.307663
H  -3.237591 1.676823 2.716377
H  4.273161 0.925547 2.278392
elementType: I O N C H
totalener: -929.21017350 hartree
nucrepener: 1245.27732318 hartree
electener: -2174.48749667 hartree
oneelecener: -3848.96347215 hartree
twoeener: 1674.47597548 hartree
cpcmener: -0.03057185 hartree
kineticenergy: 742.27307668 hartree
xcener: -77.398708103473 hartree
chargesum: -0.0000000
charge: 0.063112 -0.506621 -0.110982 -0.042861 0.123633 0.351048 -0.029322 -0.165226 -0.197204 -0.198625 -0.157862 -0.153839 -0.142070 -0.122857 -0.142617 -0.171486 0.178933 0.147610 0.160974 0.143209 0.151250 0.166125 0.162601 0.163631 0.166474 0.162968
qa: 0.0631 -0.5066 -0.1110 -0.0429 0.1236 0.3510 -0.0293 -0.1652 -0.1972 -0.1986 -0.1579 -0.1538 -0.1421 -0.1229 -0.1426 -0.1715 0.1789 0.1476 0.1610 0.1432 0.1513 0.1661 0.1626 0.1636 0.1665 0.1630
va: 1.2429 1.9921 3.1573 3.5332 3.6552 4.2197 3.9480 3.9549 3.9371 3.9427 3.9015 3.9013 3.8893 3.8771 3.9091 3.8919 1.0142 1.0066 0.9955 1.0095 0.9937 0.9873 0.9903 0.9876 0.9861 0.9886
dispcorr: -0.013587945 hartree
energy: -929.223761441719
dipole: 35.99225 -34.89862 1.09363 139.45165 -138.97809 0.47357 -1.74819 3.49587 1.74768
magnitude: 2.11534 au
magnitude: 5.37678 debye
