program: Orca
programVersion: 4.2.1
elementType: I O N C C C C C C C C C C C C C H H H H H H H H H H
elementType: I
charge: 0
multiplicity: 1
keywords: wb97x-d3
keywords: def2-TZVPP
keywords: def2/J RIJCOSX GRIDX6 NOFINALGRIDX
keywords: grid4 nofinalgrid
keywords: scfconv7
keywords: smallprint printgap noloewdin
keywords: NOSOSCF
formula: C13H10INO
InChI: InChI=1/C13H10INO/c14-12-9-5-4-8-11(12)13(16)15-10-6-2-1-3-7-10/h1-9,15H
26 atoms
I  -0.436285 -1.762354 0.10313
O  -1.058795 1.011102 -2.87538
N  0.888943 0.904231 -1.765072
C  -1.212391 1.135549 -0.528738
C  1.761616 0.940596 -0.663854
C  -0.459209 1.003829 -1.814155
C  -1.314816 0.121976 0.418189
C  -1.893375 2.331346 -0.3121
C  1.575239 1.79364 0.419906
C  2.880339 0.11057 -0.696465
C  -2.043516 0.315697 1.584037
C  -2.61372 2.534813 0.852122
C  2.472616 1.769828 1.477595
C  3.78619 0.11485 0.350992
C  -2.68038 1.527909 1.803751
C  3.578693 0.933227 1.45299
H  1.318529 0.695639 -2.657728
H  -1.833084 3.118538 -1.053083
H  0.746896 2.486456 0.448246
H  3.036168 -0.547838 -1.542466
H  -2.12524 -0.471363 2.321139
H  -3.121083 3.476082 1.01458
H  2.309838 2.429936 2.319591
H  4.650311 -0.535257 0.30878
H  -3.239772 1.674897 2.718034
H  4.278238 0.927221 2.278232
elementType: I O N C H
totalener: -929.21396128 hartree
nucrepener: 1245.18347754 hartree
electener: -2174.39743882 hartree
oneelecener: -3848.70364044 hartree
twoeener: 1674.30620162 hartree
cpcmener: -0.02517192 hartree
kineticenergy: 742.27413682 hartree
xcener: -77.397554462280 hartree
chargesum: -0.0000000
charge: 0.060633 -0.468484 -0.116748 -0.037729 0.124570 0.330593 -0.030051 -0.164763 -0.195603 -0.196696 -0.155163 -0.151266 -0.138132 -0.119509 -0.140717 -0.169113 0.174864 0.144729 0.157339 0.139722 0.148468 0.162667 0.158751 0.159763 0.162771 0.159104
qa: 0.0606 -0.4685 -0.1167 -0.0377 0.1246 0.3306 -0.0301 -0.1648 -0.1956 -0.1967 -0.1552 -0.1513 -0.1381 -0.1195 -0.1407 -0.1691 0.1749 0.1447 0.1573 0.1397 0.1485 0.1627 0.1588 0.1598 0.1628 0.1591
va: 1.2426 2.0406 3.1420 3.5357 3.6626 4.2436 3.9581 3.9606 3.9460 3.9474 3.9056 3.9053 3.8957 3.8870 3.9143 3.8995 1.0169 1.0074 0.9968 1.0104 0.9946 0.9885 0.9914 0.9889 0.9875 0.9899
dispcorr: -0.013570498 hartree
energy: -929.227531773757
dipole: 35.78671 -34.79351 0.99320 139.20519 -138.74497 0.46022 -1.61412 3.23756 1.62344
magnitude: 1.95801 au
magnitude: 4.97687 debye
