program: Orca
programVersion: 4.2.1
elementType: I O N C C C C C C C C C C C C C H H H H H H H H H H
elementType: I
charge: 0
multiplicity: 1
keywords: wb97x-d3
keywords: def2-TZVPP
keywords: def2/J RIJCOSX GRIDX6 NOFINALGRIDX
keywords: grid4 nofinalgrid
keywords: scfconv7
keywords: smallprint printgap noloewdin
keywords: NOSOSCF
formula: C13H10INO
InChI: InChI=1/C13H10INO/c14-12-9-5-4-8-11(12)13(16)15-10-6-2-1-3-7-10/h1-9,15H
26 atoms
I  -1.457181 -1.858709 0.0172
O  -0.305442 0.125347 -2.468204
N  1.657838 0.703292 -1.529405
C  -0.404409 1.006347 -0.272594
C  2.524333 0.958667 -0.451142
C  0.301015 0.544564 -1.512179
C  -1.255162 0.185321 0.458909
C  -0.272517 2.339496 0.106482
C  2.37741 0.312904 0.772677
C  3.57372 1.854703 -0.630127
C  -1.953648 0.682795 1.55008
C  -0.977832 2.847486 1.18252
C  3.249951 0.59395 1.8111
C  4.460309 2.108123 0.404075
C  -1.818539 2.015865 1.905035
C  4.295184 1.488228 1.633342
H  2.081313 0.52009 -2.427251
H  0.392746 2.984574 -0.453083
H  1.592616 -0.418249 0.913061
H  3.689782 2.360929 -1.580685
H  -2.602424 0.036158 2.124298
H  -0.866727 3.887089 1.458655
H  3.119861 0.093206 2.761189
H  5.275641 2.802481 0.250163
H  -2.370276 2.398767 2.753209
H  4.980321 1.694191 2.44447
totalener: -929.19455941 hartree
nucrepener: 1219.52602065 hartree
electener: -2148.72058006 hartree
oneelecener: -3796.94949932 hartree
twoeener: 1648.22891926 hartree
kineticenergy: 742.29497654 hartree
xcener: -77.394323742031 hartree
chargesum: -0.0000000
charge: 0.064727 -0.333524 -0.161026 -0.034177 0.147687 0.263462 -0.083272 -0.096707 -0.129360 -0.195220 -0.116834 -0.130028 -0.125606 -0.104425 -0.125598 -0.124081 0.148405 0.121230 0.120548 0.121837 0.123334 0.130596 0.129908 0.127998 0.131425 0.128702
qa: 0.0647 -0.3335 -0.1610 -0.0342 0.1477 0.2635 -0.0833 -0.0967 -0.1294 -0.1952 -0.1168 -0.1300 -0.1256 -0.1044 -0.1256 -0.1241 0.1484 0.1212 0.1205 0.1218 0.1233 0.1306 0.1299 0.1280 0.1314 0.1287
va: 1.2394 2.1712 3.0950 3.5617 3.6833 4.2655 4.0576 3.9538 3.9978 4.0347 3.9233 3.9853 3.9903 3.9703 3.9728 3.9482 1.0333 1.0093 1.0110 1.0136 1.0053 0.9992 0.9997 0.9993 0.9980 0.9992
dispcorr: -0.012734890 hartree
energy: -929.207294303021
dipole: 123.62482 -122.63926 0.98556 149.40668 -148.42760 0.97908 12.92119 -11.86483 1.05636
magnitude: 1.74523 au
magnitude: 4.43601 debye
