program: Orca
programVersion: 4.2.1
elementType: Br S S F O O O O N N N N N C C C C C C C C C C C C C H H H H H H H H H H H H H
charge: 0
multiplicity: 1
keywords: wb97x-d3
keywords: def2-TZVPP
keywords: def2/J RIJCOSX GRIDX6 NOFINALGRIDX
keywords: grid4 nofinalgrid
keywords: scfconv7
keywords: smallprint printgap noloewdin
keywords: NOSOSCF
formula: C13H13BrFN5O4S2
InChI: InChI=1/C13H13BrFN5O4S2/c1-8-12(14)10-5-4-9(15)6-11(10)20(8)25(21,22)13-16-7-19(17-13)26(23,24)18(2)3/h4-7H,1-3H3
39 atoms
Br 2.307949 -1.55815 3.126263
S  1.455693 -0.404564 -2.199997
S  -3.761179 0.077911 -1.352017
F  -0.10766 4.218496 0.260594
O  2.180513 -1.54696 -2.690342
O  1.463574 0.844898 -2.918062
O  -4.138514 0.619132 -2.6275
O  -4.518479 -0.961471 -0.707218
N  1.974322 -0.080519 -0.626742
N  -2.217839 -0.714806 -1.602625
N  -1.17956 -0.001648 -2.027264
N  -3.413981 1.266814 -0.321404
N  -0.546309 -2.083684 -1.44316
C  1.385238 0.977968 0.091524
C  2.331082 -1.1065 0.28805
C  1.396754 0.628197 1.445454
C  1.997528 -0.67005 1.523752
C  -0.218932 -0.871516 -1.90929
C  0.881454 2.197365 -0.342459
C  3.02877 -2.357004 -0.096193
C  0.894715 1.50344 2.402505
C  0.389277 3.031572 0.639515
C  0.379088 2.717154 1.992277
C  -1.830276 -1.954598 -1.246613
C  -2.789706 0.869038 0.941124
C  -2.970226 2.556692 -0.858232
H  0.878036 2.5162 -1.372945
H  3.874579 -2.161573 -0.752099
H  3.413938 -2.840393 0.798437
H  2.371013 -3.070956 -0.589929
H  0.902756 1.246397 3.453059
H  -0.022814 3.420338 2.708782
H  -2.498301 -2.711438 -0.870077
H  -2.939898 1.674544 1.654671
H  -1.715858 0.698177 0.830818
H  -3.255791 -0.022192 1.351186
H  -3.061177 3.279776 -0.052213
H  -3.615788 2.882171 -1.666946
H  -1.938338 2.531601 -1.204078
elementType: Br S F O N C H
totalener: -4548.39979415 hartree
nucrepener: 3575.08649760 hartree
electener: -8123.48629175 hartree
twoeener: 5284.14208609 hartree
cpcmener: -0.03273561 hartree
kineticenergy: 4538.37562271 hartree
xcener: -216.151087059672 hartree
chargesum: -0.0000000
charge: 0.006357 0.883641 0.877310 -0.218858 -0.471387 -0.482479 -0.459250 -0.468325 -0.052559 0.058062 -0.277863 -0.149468 -0.336978 0.021969 0.024519 0.014486 -0.118255 0.110827 -0.236977 -0.210432 -0.104121 0.293611 -0.195610 0.139568 -0.179358 -0.182192 0.166004 0.114303 0.098687 0.110378 0.145323 0.155777 0.187791 0.139137 0.059466 0.155440 0.124256 0.137975 0.119227
qa: 0.0064 0.8836 0.8773 -0.2189 -0.4714 -0.4825 -0.4592 -0.4683 -0.0526 0.0581 -0.2779 -0.1495 -0.3370 0.0220 0.0245 0.0145 -0.1183 0.1108 -0.2370 -0.2104 -0.1041 0.2936 -0.1956 0.1396 -0.1794 -0.1822 0.1660 0.1143 0.0987 0.1104 0.1453 0.1558 0.1878 0.1391 0.0595 0.1554 0.1243 0.1380 0.1192
va: 1.2797 5.7625 5.9851 1.0578 2.0317 2.0157 2.0438 2.0369 3.2135 3.3499 2.9428 3.0572 3.0536 3.8364 3.7088 3.6350 4.0030 4.1309 3.8716 3.9195 3.8930 3.8749 3.9323 4.0136 3.9094 3.8807 1.0190 1.0015 1.0106 1.0069 1.0066 0.9984 0.9903 0.9909 0.9918 1.0052 0.9906 1.0096 0.9928
dispcorr: -0.028739785 hartree
energy: -4548.428533932914
dipole: -28.51999 27.75602 -0.76397 17.51049 -17.02713 0.48336 -25.20544 28.22834 3.02290
magnitude: 3.15519 au
magnitude: 8.01986 debye
