program: Orca
programVersion: 4.2.1
elementType: Br S S F O O O O N N N N N C C C C C C C C C C C C C H H H H H H H H H H H H H
charge: 0
multiplicity: 1
keywords: wb97x-d3
keywords: def2-TZVPP
keywords: def2/J RIJCOSX GRIDX6 NOFINALGRIDX
keywords: grid4 nofinalgrid
keywords: scfconv7
keywords: smallprint printgap noloewdin
keywords: NOSOSCF
formula: C13H13BrFN5O4S2
InChI: InChI=1/C13H13BrFN5O4S2/c1-8-12(14)10-5-4-9(15)6-11(10)20(8)25(21,22)13-16-7-19(17-13)26(23,24)18(2)3/h4-7H,1-3H3
39 atoms
Br 3.068555 1.951162 -1.035337
S  0.55559 -2.673436 0.757287
S  -2.99811 0.260568 -1.908268
F  -1.092475 1.061651 4.3777
O  0.251405 -3.078487 2.1084
O  1.296109 -3.559826 -0.103935
O  -2.586136 0.099836 -3.276081
O  -4.384836 0.195678 -1.52948
N  1.339495 -1.193728 0.829004
N  -2.323944 -1.115853 -1.044284
N  -1.059749 -1.078442 -0.645076
N  -2.26543 1.525536 -1.250236
N  -2.045821 -2.996835 -0.003269
C  0.849922 -0.154914 1.638643
C  2.11635 -0.637315 -0.217633
C  1.36438 1.04395 1.134274
C  2.149858 0.699343 -0.011662
C  -0.959601 -2.217149 -0.027708
C  0.007104 -0.180763 2.742579
C  2.781231 -1.429611 -1.278464
C  1.044673 2.255357 1.738359
C  -0.283684 1.043121 3.30805
C  0.209419 2.253897 2.837577
C  -2.906248 -2.264921 -0.660448
C  -0.950191 1.941236 -1.744646
C  -2.502316 1.797024 0.168091
H  -0.407553 -1.081352 3.168083
H  3.41034 -0.771674 -1.87241
H  3.417895 -2.210326 -0.866898
H  2.067743 -1.893351 -1.958864
H  1.437446 3.188687 1.358144
H  -0.06203 3.17735 3.330301
H  -3.930705 -2.521298 -0.874242
H  -0.848457 3.002542 -1.532281
H  -0.872914 1.808498 -2.81834
H  -0.150061 1.394673 -1.250434
H  -2.317401 2.854829 0.335772
H  -1.833858 1.215765 0.804657
H  -3.532119 1.593232 0.44512
elementType: Br S F O N C H
totalener: -4548.39887564 hartree
nucrepener: 3618.14139896 hartree
electener: -8166.54027460 hartree
twoeener: 5326.61761676 hartree
cpcmener: -0.03278715 hartree
kineticenergy: 4538.38326977 hartree
xcener: -216.159941754207 hartree
chargesum: -0.0000000
charge: 0.005031 0.849124 0.859264 -0.218230 -0.478220 -0.465171 -0.461715 -0.471035 -0.030627 0.053633 -0.286363 -0.145209 -0.352161 -0.076307 0.114560 0.050526 -0.207292 0.166932 -0.148759 -0.210255 -0.123660 0.289931 -0.201318 0.137789 -0.161460 -0.162159 0.152034 0.096930 0.116529 0.117709 0.142731 0.154572 0.188221 0.128374 0.143981 0.085627 0.128884 0.072676 0.144883
qa: 0.0050 0.8491 0.8593 -0.2182 -0.4782 -0.4652 -0.4617 -0.4710 -0.0306 0.0536 -0.2864 -0.1452 -0.3522 -0.0763 0.1146 0.0505 -0.2073 0.1669 -0.1488 -0.2103 -0.1237 0.2899 -0.2013 0.1378 -0.1615 -0.1622 0.1520 0.0969 0.1165 0.1177 0.1427 0.1546 0.1882 0.1284 0.1440 0.0856 0.1289 0.0727 0.1449
va: 1.2725 5.7811 5.9934 1.0627 2.0168 2.0212 2.0326 2.0306 3.2225 3.3658 2.9058 3.0972 3.0913 3.9584 3.6257 3.4917 3.9592 4.0562 3.8780 3.9148 3.8666 3.9577 3.9165 4.0241 3.8838 3.8841 1.0245 1.0116 1.0005 1.0006 1.0104 0.9979 0.9882 0.9917 1.0096 0.9791 0.9907 1.0059 1.0109
dispcorr: -0.029358868 hartree
energy: -4548.428234504428
dipole: -30.92919 30.84331 -0.08587 -9.94840 12.80439 2.85599 3.89994 -4.23429 -0.33434
magnitude: 2.87677 au
magnitude: 7.31217 debye
