program: Orca
programVersion: 4.2.1
elementType: Br S S F O O O O N N N N N C C C C C C C C C C C C C H H H H H H H H H H H H H
charge: 0
multiplicity: 1
keywords: wb97x-d3
keywords: def2-TZVPP
keywords: def2/J RIJCOSX GRIDX6 NOFINALGRIDX
keywords: grid4 nofinalgrid
keywords: scfconv7
keywords: smallprint printgap noloewdin
keywords: NOSOSCF
formula: C13H13BrFN5O4S2
InChI: InChI=1/C13H13BrFN5O4S2/c1-8-12(14)10-5-4-9(15)6-11(10)20(8)25(21,22)13-16-7-19(17-13)26(23,24)18(2)3/h4-7H,1-3H3
39 atoms
Br 4.798377 0.925967 -0.38085
S  0.150218 -2.024309 0.659729
S  -3.892813 0.636973 -1.574923
F  -0.597751 2.568162 3.573357
O  -0.560056 -2.005487 1.912448
O  0.724171 -3.235871 0.138667
O  -3.534546 1.921506 -1.040674
O  -4.246961 0.454097 -2.957888
N  1.366243 -0.870548 0.762463
N  -2.436402 -0.336138 -1.45399
N  -1.964778 -0.656522 -0.25465
N  -4.93663 -0.095548 -0.605241
N  -0.653966 -1.483428 -1.884694
C  1.214875 0.340313 1.447925
C  2.565551 -0.846178 0.016363
C  2.348415 1.114368 1.168909
C  3.160626 0.342003 0.280632
C  -0.906764 -1.344572 -0.575632
C  0.188454 0.814455 2.257763
C  3.037065 -1.943758 -0.862621
C  2.488796 2.379963 1.730552
C  0.367988 2.07552 2.782949
C  1.487633 2.864535 2.547104
C  -1.648549 -0.833685 -2.427652
C  -4.965141 0.22517 0.821897
C  -5.37443 -1.444846 -0.954052
H  -0.704244 0.256759 2.494109
H  3.957312 -1.635371 -1.35262
H  3.25201 -2.854534 -0.305564
H  2.320074 -2.184359 -1.646724
H  3.364836 2.983074 1.532135
H  1.564656 3.843877 2.999814
H  -1.835548 -0.701251 -3.480867
H  -4.711798 1.265545 0.997008
H  -4.290718 -0.413619 1.391861
H  -5.984171 0.066864 1.168317
H  -6.370961 -1.588377 -0.542116
H  -4.708472 -2.201699 -0.535255
H  -5.439588 -1.577303 -2.030194
elementType: Br S F O N C H
totalener: -4548.40303089 hartree
nucrepener: 3430.76210171 hartree
electener: -7979.16513260 hartree
twoeener: 5141.26530142 hartree
cpcmener: -0.02892074 hartree
kineticenergy: 4538.33573465 hartree
xcener: -216.146868831929 hartree
chargesum: 0.0000000
charge: -0.000814 0.849966 0.854167 -0.219461 -0.467433 -0.460321 -0.452248 -0.467022 -0.013615 0.072325 -0.288583 -0.161658 -0.356767 0.008210 0.057442 0.000310 -0.151358 0.142800 -0.190382 -0.202473 -0.107060 0.281985 -0.210594 0.130431 -0.156437 -0.165125 0.142416 0.095226 0.115291 0.110023 0.142287 0.152385 0.186744 0.128566 0.115673 0.119489 0.121496 0.114393 0.129723
qa: -0.0008 0.8500 0.8542 -0.2195 -0.4674 -0.4603 -0.4522 -0.4670 -0.0136 0.0723 -0.2886 -0.1617 -0.3568 0.0082 0.0574 0.0003 -0.1514 0.1428 -0.1904 -0.2025 -0.1071 0.2820 -0.2106 0.1304 -0.1564 -0.1651 0.1424 0.0952 0.1153 0.1100 0.1423 0.1524 0.1867 0.1286 0.1157 0.1195 0.1215 0.1144 0.1297
va: 1.2724 5.7906 6.0123 1.0608 2.0300 2.0403 2.0444 2.0330 3.2334 3.3388 2.9317 3.1165 3.0692 3.9433 3.7125 3.7169 4.0335 4.1008 3.9363 3.9100 3.8951 4.0116 3.9448 4.0225 3.8785 3.8831 1.0280 1.0126 0.9979 1.0107 1.0081 0.9981 0.9891 1.0075 0.9960 0.9936 0.9946 0.9934 1.0055
dispcorr: -0.023615253 hartree
energy: -4548.426646139104
dipole: -62.58740 60.71545 -1.87195 -15.55103 15.16755 -0.38348 0.72864 -1.42359 -0.69495
magnitude: 2.03328 au
magnitude: 5.16818 debye
