program: Gaussian 09
title: 000069341
version: EM64L-G09RevD.01
frameworkgroup: C1[X(C5H9ClO2)]
method: RPBEPBE
basis: SDD
operation: Freq
keyword: #p
keyword: freq=noraman
keyword: PBEPBE/SDD
title: #p freq=noraman PBEPBE/SDD
converged: YES YES NO NO
title: Mulliken charges:
elementType: Cl O O C C C C C H H H H H H H H H
charge: -0.067157 -0.260238 -0.248640 -0.451294 -0.228982 0.261777 -0.562945 -0.670338 0.265764 0.265949 0.231596 0.230785 0.277703 0.279125 0.213972 0.231567 0.231356
chargesum: 0.00000
title: Mulliken charges with hydrogens summed into heavy atoms:
elementType: Cl O O C C C C C
charge: -0.067157 -0.260238 -0.248640 0.080419 0.233399 0.261777 -0.006117 0.006557
polarizability: 9.61698915e+01 -3.09972319e+00 6.43459053e+01 -1.18025013e-01 1.71976066e-01 4.73962259e+01
1716.lowfreq: -30.3037 -4.7138 -0.0018 0.0006 0.0012 6.5734 35.0865 46.6688 62.5155
frequency: 24.3111 46.6017 62.4376 89.9471 152.7798 215.1922 243.8690 249.8566 341.5067 419.6801 556.1871 628.6597 721.3753 779.4861 796.3457 816.3823 910.8215 991.9972 1019.1493 1080.9989 1113.5271 1129.1905 1135.2755 1142.5279 1247.8578 1255.6147 1262.9482 1334.9784 1359.7446 1399.4451 1447.3544 1461.3696 1463.2703 1473.4888 1486.0236 1629.7388 2996.4525 3011.9953 3019.3749 3071.0162 3072.8801 3078.4444 3093.2404 3108.7804 3162.2423
redmass: 2.2804 2.7597 3.2601 5.2687 2.1393 4.5968 9.4788 1.2784 4.2239 3.9010 2.7211 8.1946 5.4878 1.2552 1.0998 3.6906 5.9425 1.5306 2.2690 4.0352 2.2614 1.1972 1.4735 2.8534 1.1353 1.2863 1.1514 1.4840 1.5140 1.2654 1.0926 1.0978 1.0404 1.0606 1.0687 9.5168 1.0358 1.0582 1.0611 1.1066 1.1003 1.0572 1.0985 1.1028 1.1114
irintensity: 0.0101 1.7441 0.8773 0.6249 10.8901 14.5405 0.4582 1.8691 7.7642 4.5554 1.2874 40.9609 24.2529 14.0802 3.1738 19.1440 16.1210 0.7324 53.6389 25.2313 8.6018 4.4654 9.9274 305.9991 0.0123 41.5851 1.2535 91.7848 19.5409 18.8927 29.8181 9.6697 12.4804 4.8193 14.3262 182.8989 19.3108 17.8546 6.6250 6.3485 3.1530 10.3897 28.1271 44.1007 10.1319
temp: 298.150 k
press: 1.00000 atm
elementType: 17 8 8 6 6 6 6 6 1 1 1 1 1 1 1 1 1
symmnumber: 1
zpe: 353522.6 jmol-1
zpe.correction: 0.134650 hartree
zpe.thermalcorrener: 0.144606 hartree
zpe.thermalcorrenthalpy: 0.145550 hartree
zpe.thermalcorrgfe: 0.096818 hartree
zpe.sumelectzpe: -805.795682 hartree
zpe.sumelectthermal: -805.785725 hartree
zpe.sumelectthermalent: -805.784781 hartree
zpe.sumelectthermalfe: -805.833514 hartree
dipole: -3.1612 -0.6943 0.0072
dipole: 3.2365
quadrupole: -54.5078 -60.2640 -53.0909
quadrupole: 2.6050 0.0200 -0.0003
quadrupole: 1.4464 -4.3098 2.8633 2.6050 0.0200 -0.0003
hfenergy: -805.9303312 hartree
pointgroup: C01 [X(C5H9Cl1O2)]
dipole: -1.2539125 -0.2216238 0.0039586 debye
dipolederiv: -0.5726533 0.1034065 -0.0061826 0.1887584 -0.2546603 0.0029338 -0.0069397 0.0016461 -0.1813934 -1.7118963 -0.2809476 0.0036492 -0.3339777 -0.5883994 0.0087014 0.0075067 0.0091318 -0.2805545 -0.7198423 0.0789151 -0.0054593 -0.3381662 -0.9237747 0.0179498 0.0088506 0.0196043 -0.3038516 -0.3004157 0.0787849 -0.0045204 0.291087 -0.2183469 0.0075886 -0.0027529 0.0022567 0.0920048 0.9059319 0.0361551 0.0011816 -0.1431066 0.2370359 0.0025355 0.0049678 0.0019187 0.3521557 1.6892864 0.1249117 0.0015628 0.5778892 1.2681878 -0.0306731 -0.0170856 -0.0303098 0.197872 0.7009087 -0.227075 0.0085559 -0.2420535 0.2906389 -0.0034975 0.0078662 -0.0017626 0.2025354 -0.1096015 -0.0778719 0.004417 -0.0596953 0.0007428 0.0049327 0.0038645 0.0045773 0.0594381 0.0604784 0.0017202 0.0200007 -0.0510249 0.0602049 0.0737601 0.0167777 0.0852202 0.0076567 0.060794 0.0056967 -0.0179206 -0.0470456 0.0585486 -0.0751284 -0.0163014 -0.0845479 0.0079071 -0.0411905 -0.0311546 -0.0261454 0.0576617 -0.0098782 -0.0918322 0.009493 -0.1039664 -0.0467257 -0.0439702 -0.0271888 0.0269249 0.0569033 0.009805 0.0873001 -0.0153612 0.1004167 -0.0700807 -0.0010472 0.0582515 0.0028037 0.0158361 0.0056156 -0.0765352 -0.0178825 -0.0814373 -0.0166733 0.0007122 0.0557298 -0.002492 0.0129222 0.007886 0.0758429 0.0186047 0.0813869 -0.0151714 -0.1384035 0.0698896 -0.0032689 0.0901528 0.0381074 0.0037564 -0.0041055 0.0039655 0.1172199 0.1104885 0.0167217 0.0321602 -0.0383836 -0.0029085 -0.1053514 0.0066004 -0.1199499 -0.0491007 0.1104205 0.0140551 -0.0352667 -0.0377571 0.0211948 0.0977165 -0.0041027 0.1118497 -0.0732385 unknown
polarizability: 95.8597808|-4.3921695|64.6419057|0.3421274|-0.5096222|47.4103361 unknown
InChI: InChI=1S/C5H9ClO2/c1-2-8-5(7)3-4-6/h2-4H2,1H3
charge 0 multiplicity 1
17 atoms
Cl 3.96754 -0.744701 0.041858
O  -1.211382 -0.467661 -0.013445
O  -0.113393 1.589133 -0.07364
C  1.184617 -0.517728 -0.003587
C  -2.529469 0.248041 -0.044326
C  -0.076511 0.336205 -0.034025
C  2.437322 0.360726 0.013839
C  -3.612296 -0.822924 0.020544
H  1.151905 -1.176671 0.8829
H  1.185545 -1.18573 -0.884324
H  -2.563568 0.943194 0.813756
H  -2.574116 0.844584 -0.973328
H  2.500477 0.988265 0.913205
H  2.528806 0.983133 -0.88651
H  -4.609345 -0.346486 -0.001397
H  -3.538483 -1.512717 -0.837396
H  -3.529649 -1.412362 0.949476
