program: Orca
programVersion: 4.2.1
elementType: Br S S F O O O O N N N N N C C C C C C C C C C C C C H H H H H H H H H H H H H
charge: 0
multiplicity: 1
keywords: wb97x-d3
keywords: def2-TZVPP
keywords: def2/J RIJCOSX GRIDX6 NOFINALGRIDX
keywords: grid4 nofinalgrid
keywords: scfconv7
keywords: smallprint printgap noloewdin
keywords: NOSOSCF
formula: C13H13BrFN5O4S2
InChI: InChI=1/C13H13BrFN5O4S2/c1-8-12(14)10-5-4-9(15)6-11(10)20(8)25(21,22)13-16-7-19(17-13)26(23,24)18(2)3/h4-7H,1-3H3
39 atoms
Br 4.794796 0.964311 -0.264547
S  0.153672 -2.076849 0.517202
S  -3.908157 0.609725 -1.667921
F  -0.723272 2.365412 3.614102
O  -0.580543 -2.129694 1.755207
O  0.750752 -3.254416 -0.0536
O  -3.506177 1.945544 -1.323829
O  -4.378596 0.275797 -2.985949
N  1.355229 -0.918636 0.703731
N  -2.443756 -0.358802 -1.559239
N  -1.977786 -0.714778 -0.368458
N  -4.856274 0.003623 -0.532716
N  -0.61278 -1.418547 -2.010853
C  1.169895 0.259817 1.435289
C  2.574878 -0.849407 -0.005546
C  2.299332 1.059385 1.219416
C  3.14576 0.334749 0.322883
C  -0.891203 -1.350517 -0.701643
C  0.11752 0.684217 2.23931
C  3.092411 -1.909437 -0.904623
C  2.40853 2.300346 1.839906
C  0.267193 1.922082 2.825281
C  1.381483 2.734754 2.652588
C  -1.622131 -0.780474 -2.539958
C  -5.356146 -1.359596 -0.686851
C  -4.777893 0.495728 0.841726
H  -0.771282 0.102837 2.428641
H  2.40741 -2.135111 -1.721027
H  4.024485 -1.571877 -1.351315
H  3.302749 -2.834665 -0.369575
H  3.281258 2.922349 1.691522
H  1.43466 3.693149 3.151188
H  -1.797885 -0.605484 -3.588948
H  -6.343691 -1.407326 -0.232938
H  -4.702494 -2.078013 -0.190398
H  -5.458998 -1.631049 -1.733212
H  -4.486345 1.540251 0.870912
H  -4.080657 -0.093054 1.436943
H  -5.773497 0.41532 1.273171
elementType: Br S F O N C H
totalener: -4548.40242764 hartree
nucrepener: 3432.79678358 hartree
electener: -7981.19921123 hartree
twoeener: 5143.19975841 hartree
cpcmener: -0.02832054 hartree
kineticenergy: 4538.34499760 hartree
xcener: -216.148972333270 hartree
chargesum: 0.0000000
charge: -0.000505 0.850771 0.844650 -0.219383 -0.468491 -0.461109 -0.453649 -0.466006 -0.013373 0.079799 -0.286740 -0.154961 -0.357782 0.007555 0.058096 -0.000893 -0.151349 0.139191 -0.190697 -0.201114 -0.105630 0.281701 -0.210131 0.125302 -0.163497 -0.157256 0.142127 0.108978 0.095105 0.115192 0.142222 0.152650 0.188036 0.122377 0.115564 0.128270 0.129087 0.116336 0.119558
qa: -0.0005 0.8508 0.8446 -0.2194 -0.4685 -0.4611 -0.4536 -0.4660 -0.0134 0.0798 -0.2867 -0.1550 -0.3578 0.0076 0.0581 -0.0009 -0.1513 0.1392 -0.1907 -0.2011 -0.1056 0.2817 -0.2101 0.1253 -0.1635 -0.1573 0.1421 0.1090 0.0951 0.1152 0.1422 0.1526 0.1880 0.1224 0.1156 0.1283 0.1291 0.1163 0.1196
va: 1.2725 5.7908 6.0147 1.0610 2.0285 2.0396 2.0395 2.0310 3.2346 3.3402 2.9437 3.1255 3.0723 3.9492 3.7102 3.7187 4.0323 4.1078 3.9384 3.9110 3.8946 4.0132 3.9464 4.0260 3.8785 3.8766 1.0263 1.0104 1.0124 0.9979 1.0081 0.9980 0.9880 0.9941 0.9940 1.0062 1.0073 0.9952 0.9935
dispcorr: -0.023665288 hartree
energy: -4548.426092930531
dipole: -61.83483 60.10397 -1.73086 -14.69006 14.61202 -0.07803 0.55585 -0.93139 -0.37554
magnitude: 1.77285 au
magnitude: 4.50622 debye
