program: Orca
programVersion: 4.2.1
elementType: Br S S F O O O O N N N N N C C C C C C C C C C C C C H H H H H H H H H H H H H
charge: 0
multiplicity: 1
keywords: wb97x-d3
keywords: def2-TZVPP
keywords: def2/J RIJCOSX GRIDX6 NOFINALGRIDX
keywords: grid4 nofinalgrid
keywords: scfconv7
keywords: smallprint printgap noloewdin
keywords: NOSOSCF
formula: C13H13BrFN5O4S2
InChI: InChI=1/C13H13BrFN5O4S2/c1-8-12(14)10-5-4-9(15)6-11(10)20(8)25(21,22)13-16-7-19(17-13)26(23,24)18(2)3/h4-7H,1-3H3
39 atoms
Br 3.580955 1.899507 -0.626687
S  0.57195 -2.651893 0.54001
S  -2.865617 0.441706 -2.093148
F  -1.332664 1.037406 4.119947
O  0.071123 -3.057723 1.830044
O  1.413337 -3.540778 -0.217515
O  -1.940032 0.939445 -3.070184
O  -4.184916 -0.010062 -2.444839
N  1.35215 -1.183943 0.735686
N  -2.143685 -1.02604 -1.465944
N  -0.992786 -0.939294 -0.807873
N  -2.906498 1.420198 -0.820338
N  -1.746449 -3.056209 -0.831665
C  0.856807 -0.170371 1.567793
C  2.306271 -0.636285 -0.153939
C  1.537189 1.00618 1.233608
C  2.429078 0.672983 0.166101
C  -0.809368 -2.176821 -0.4536
C  -0.131038 -0.189319 2.545589
C  3.029116 -1.410803 -1.191162
C  1.252797 2.1949 1.899331
C  -0.385689 1.012808 3.170185
C  0.278793 2.197905 2.876881
C  -2.591688 -2.296292 -1.4770
C  -3.712602 1.009309 0.325693
C  -1.736301 2.235747 -0.49328
H  -0.68094 -1.071776 2.834596
H  3.602287 -2.232314 -0.763898
H  2.362931 -1.819581 -1.950495
H  3.728971 -0.753837 -1.701843
H  1.775892 3.10961 1.653956
H  0.030076 3.105128 3.410806
H  -3.508346 -2.607396 -1.950834
H  -3.145858 0.36908 1.005958
H  -4.616368 0.492811 0.014967
H  -4.013118 1.906972 0.861429
H  -1.257077 2.611984 -1.391141
H  -1.010987 1.681622 0.102301
H  -2.090617 3.090182 0.079075
elementType: Br S F O N C H
totalener: -4548.40067808 hartree
nucrepener: 3573.35491947 hartree
electener: -8121.75559755 hartree
twoeener: 5282.46532131 hartree
cpcmener: -0.02838959 hartree
kineticenergy: 4538.36302509 hartree
xcener: -216.153273096948 hartree
chargesum: 0.0000000
charge: 0.001007 0.840842 0.860687 -0.218485 -0.466279 -0.454916 -0.449554 -0.464785 -0.018973 0.043055 -0.290751 -0.160061 -0.350059 -0.031386 0.066814 0.036409 -0.156553 0.168071 -0.192882 -0.206923 -0.123709 0.290571 -0.195400 0.133264 -0.178945 -0.120204 0.150978 0.115657 0.117089 0.095968 0.140882 0.152043 0.186439 0.107183 0.137079 0.126989 0.133523 0.046786 0.128530
qa: 0.0010 0.8408 0.8607 -0.2185 -0.4663 -0.4549 -0.4496 -0.4648 -0.0190 0.0431 -0.2908 -0.1601 -0.3501 -0.0314 0.0668 0.0364 -0.1566 0.1681 -0.1929 -0.2069 -0.1237 0.2906 -0.1954 0.1333 -0.1789 -0.1202 0.1510 0.1157 0.1171 0.0960 0.1409 0.1520 0.1864 0.1072 0.1371 0.1270 0.1335 0.0468 0.1285
va: 1.2746 5.7958 6.0131 1.0600 2.0262 2.0387 2.0507 2.0406 3.2343 3.3604 2.8746 3.0948 3.0914 3.9057 3.6716 3.5679 4.0424 4.0524 3.8754 3.9136 3.8809 3.9449 3.9126 4.0242 3.8903 3.8759 1.0258 0.9996 0.9996 1.0121 1.0101 0.9987 0.9906 0.9894 1.0067 0.9932 1.0122 1.0107 0.9932
dispcorr: -0.027673151 hartree
energy: -4548.428351231332
dipole: -40.51057 39.45770 -1.05287 -11.21581 13.41224 2.19642 4.06649 -3.75139 0.31510
magnitude: 2.45603 au
magnitude: 6.24274 debye
