program: Orca
programVersion: 4.2.1
elementType: Br S S F O O O O N N N N N C C C C C C C C C C C C C H H H H H H H H H H H H H
charge: 0
multiplicity: 1
keywords: wb97x-d3
keywords: def2-TZVPP
keywords: def2/J RIJCOSX GRIDX6 NOFINALGRIDX
keywords: grid4 nofinalgrid
keywords: scfconv7
keywords: smallprint printgap noloewdin
keywords: NOSOSCF
formula: C13H13BrFN5O4S2
InChI: InChI=1/C13H13BrFN5O4S2/c1-8-12(14)10-5-4-9(15)6-11(10)20(8)25(21,22)13-16-7-19(17-13)26(23,24)18(2)3/h4-7H,1-3H3
39 atoms
Br 3.548885 1.910959 -0.6449
S  0.580218 -2.655731 0.555071
S  -2.851885 0.423174 -2.10653
F  -1.31168 1.020531 4.152352
O  0.087172 -3.065968 1.846735
O  1.421772 -3.542549 -0.204488
O  -1.93629 0.878132 -3.115073
O  -4.185001 -0.013887 -2.423113
N  1.353937 -1.185278 0.743744
N  -2.145192 -1.038035 -1.448951
N  -0.983013 -0.953811 -0.810094
N  -2.852862 1.439389 -0.860732
N  -1.766423 -3.059322 -0.77422
C  0.860803 -0.173799 1.580243
C  2.295275 -0.631709 -0.156444
C  1.532052 1.006353 1.239857
C  2.414723 0.677796 0.162934
C  -0.811171 -2.184566 -0.429205
C  -0.117334 -0.199098 2.567148
C  3.005632 -1.402145 -1.205163
C  1.248034 2.192875 1.909556
C  -0.37298 1.001594 3.194271
C  0.282796 2.189975 2.895906
C  -2.610659 -2.303188 -1.423603
C  -3.640758 1.067371 0.311567
C  -1.663716 2.242587 -0.578896
H  -0.658985 -1.085467 2.8596
H  3.597659 -2.214565 -0.786486
H  2.327492 -1.823012 -1.946837
H  3.685341 -0.739552 -1.734988
H  1.764474 3.110164 1.659659
H  0.033776 3.094804 3.433792
H  -3.538262 -2.613249 -1.876173
H  -3.92841 1.981635 0.825841
H  -3.064884 0.444248 1.000197
H  -4.552164 0.54606 0.032307
H  -1.991546 3.121073 -0.027197
H  -1.194042 2.583267 -1.496014
H  -0.936861 1.694479 0.020519
elementType: Br S F O N C H
totalener: -4548.40059422 hartree
nucrepener: 3575.02825193 hartree
electener: -8123.42884616 hartree
twoeener: 5284.09626436 hartree
cpcmener: -0.02837163 hartree
kineticenergy: 4538.35318970 hartree
xcener: -216.151457864880 hartree
chargesum: 0.0000000
charge: 0.001447 0.840704 0.861043 -0.218456 -0.466816 -0.454807 -0.450429 -0.464470 -0.017956 0.043125 -0.290972 -0.160097 -0.349794 -0.029786 0.068884 0.029585 -0.155156 0.168603 -0.197010 -0.206639 -0.122136 0.292387 -0.193994 0.133394 -0.180649 -0.123156 0.151237 0.116251 0.116497 0.095659 0.140704 0.152155 0.186380 0.128223 0.106718 0.137109 0.128267 0.133010 0.050943
qa: 0.0014 0.8407 0.8610 -0.2185 -0.4668 -0.4548 -0.4504 -0.4645 -0.0180 0.0431 -0.2910 -0.1601 -0.3498 -0.0298 0.0689 0.0296 -0.1552 0.1686 -0.1970 -0.2066 -0.1221 0.2924 -0.1940 0.1334 -0.1806 -0.1232 0.1512 0.1163 0.1165 0.0957 0.1407 0.1522 0.1864 0.1282 0.1067 0.1371 0.1283 0.1330 0.0509
va: 1.2749 5.7970 6.0099 1.0598 2.0263 2.0380 2.0492 2.0406 3.2326 3.3574 2.8745 3.0918 3.0917 3.9008 3.6675 3.5676 4.0373 4.0503 3.8778 3.9137 3.8792 3.9442 3.9133 4.0243 3.8910 3.8763 1.0258 0.9993 1.0002 1.0122 1.0101 0.9984 0.9906 0.9930 0.9888 1.0071 0.9931 1.0126 1.0079
dispcorr: -0.027723435 hartree
energy: -4548.428317658974
dipole: -39.89319 38.88648 -1.00671 -11.09937 13.34558 2.24621 3.97894 -3.68597 0.29297
magnitude: 2.47886 au
magnitude: 6.30077 debye
