program: Orca
programVersion: 4.2.1
elementType: Br S S F O O O O N N N N N C C C C C C C C C C C C C H H H H H H H H H H H H H
charge: 0
multiplicity: 1
keywords: wb97x-d3
keywords: def2-TZVPP
keywords: def2/J RIJCOSX GRIDX6 NOFINALGRIDX
keywords: grid4 nofinalgrid
keywords: scfconv7
keywords: smallprint printgap noloewdin
keywords: NOSOSCF
formula: C13H13BrFN5O4S2
InChI: InChI=1/C13H13BrFN5O4S2/c1-8-12(14)10-5-4-9(15)6-11(10)20(8)25(21,22)13-16-7-19(17-13)26(23,24)18(2)3/h4-7H,1-3H3
39 atoms
Br 4.281915 1.378114 -0.172557
S  0.30851 -2.498808 0.305611
S  -3.879328 0.147794 -1.639918
F  -1.661857 1.581748 3.313262
O  -0.477151 -2.82786 1.466307
O  1.08009 -3.494195 -0.387808
O  -3.776343 0.967127 -2.817402
O  -4.834587 -0.917539 -1.523398
N  1.33692 -1.23607 0.737888
N  -2.30793 -0.632095 -1.612073
N  -1.943801 -1.305885 -0.525779
N  -3.882711 1.048502 -0.309621
N  -0.292939 -1.285569 -2.053181
C  0.836049 -0.101355 1.391213
C  2.542631 -0.899327 0.079995
C  1.742428 0.942184 1.170962
C  2.792693 0.40151 0.362529
C  -0.737238 -1.673296 -0.84883
C  -0.329323 0.08392 2.125868
C  3.361537 -1.852587 -0.706674
C  1.49947 2.204452 1.703241
C  -0.53733 1.355289 2.616756
C  0.342893 2.413695 2.427884
C  -1.313684 -0.620061 -2.523112
C  -4.269994 0.455818 0.970219
C  -2.920903 2.1454 -0.236018
H  -1.040629 -0.700112 2.336357
H  3.576994 -2.763008 -0.150277
H  2.884074 -2.130974 -1.645831
H  4.312924 -1.387869 -0.954265
H  2.195514 3.018097 1.548234
H  0.117716 3.385438 2.846362
H  -1.381199 -0.13123 -3.481377
H  -4.69309 1.249567 1.581911
H  -3.419125 0.016783 1.49005
H  -5.033801 -0.303164 0.83602
H  -2.869422 2.691083 -1.173807
H  -1.921171 1.797555 0.034356
H  -3.266494 2.836247 0.529468
elementType: Br S F O N C H
totalener: -4548.40121417 hartree
nucrepener: 3530.00396294 hartree
electener: -8078.40517711 hartree
twoeener: 5239.40201751 hartree
cpcmener: -0.02708194 hartree
kineticenergy: 4538.35012203 hartree
xcener: -216.148122786645 hartree
chargesum: 0.0000000
charge: 0.003238 0.874555 0.864091 -0.218293 -0.468814 -0.460992 -0.463191 -0.449058 -0.047349 0.058739 -0.271246 -0.154166 -0.344681 0.042341 0.037198 0.007294 -0.130881 0.106410 -0.245912 -0.205239 -0.103098 0.253512 -0.177439 0.135775 -0.158581 -0.181517 0.168590 0.112625 0.112423 0.096010 0.144397 0.154174 0.186571 0.123920 0.100175 0.134167 0.146982 0.092556 0.124713
qa: 0.0032 0.8746 0.8641 -0.2183 -0.4688 -0.4610 -0.4632 -0.4491 -0.0473 0.0587 -0.2712 -0.1542 -0.3447 0.0423 0.0372 0.0073 -0.1309 0.1064 -0.2459 -0.2052 -0.1031 0.2535 -0.1774 0.1358 -0.1586 -0.1815 0.1686 0.1126 0.1124 0.0960 0.1444 0.1542 0.1866 0.1239 0.1002 0.1342 0.1470 0.0926 0.1247
va: 1.2758 5.7809 6.0090 1.0566 2.0314 2.0433 2.0421 2.0528 3.2394 3.3449 2.9434 3.0922 3.0596 3.8621 3.7128 3.7021 4.0070 4.1386 3.8913 3.9149 3.9170 3.9447 3.9607 4.0176 3.8837 3.8953 1.0133 1.0017 1.0059 1.0118 1.0065 0.9977 0.9896 0.9921 0.9937 1.0098 1.0057 0.9965 0.9925
dispcorr: -0.027244761 hartree
energy: -4548.428458927784
dipole: -48.13294 48.18896 0.05602 -7.11987 9.86605 2.74618 2.03072 -1.83667 0.19404
magnitude: 2.75360 au
magnitude: 6.99910 debye
