program: Orca
programVersion: 4.2.1
elementType: Br S S F O O O O N N N N N C C C C C C C C C C C C C H H H H H H H H H H H H H
charge: 0
multiplicity: 1
keywords: wb97x-d3
keywords: def2-TZVPP
keywords: def2/J RIJCOSX GRIDX6 NOFINALGRIDX
keywords: grid4 nofinalgrid
keywords: scfconv7
keywords: smallprint printgap noloewdin
keywords: NOSOSCF
formula: C13H13BrFN5O4S2
InChI: InChI=1/C13H13BrFN5O4S2/c1-8-12(14)10-5-4-9(15)6-11(10)20(8)25(21,22)13-16-7-19(17-13)26(23,24)18(2)3/h4-7H,1-3H3
39 atoms
Br 4.175612 1.445193 -0.236827
S  0.337781 -2.54282 0.334502
S  -3.824259 0.147582 -1.602369
F  -1.666909 1.476839 3.417295
O  -0.443368 -2.882644 1.495386
O  1.129712 -3.527001 -0.352416
O  -3.742202 0.884105 -2.83496
O  -4.816592 -0.864061 -1.372155
N  1.343279 -1.26018 0.766162
N  -2.285054 -0.694686 -1.591853
N  -1.91228 -1.343021 -0.493001
N  -3.728537 1.129995 -0.334247
N  -0.289984 -1.396408 -2.049986
C  0.821363 -0.135924 1.423319
C  2.521372 -0.887847 0.076112
C  1.685168 0.935725 1.16976
C  2.732866 0.42344 0.339773
C  -0.718998 -1.742634 -0.827476
C  -0.326266 0.016207 2.192668
C  3.357353 -1.820976 -0.716809
C  1.414025 2.194415 1.696592
C  -0.5614 1.283633 2.681775
C  0.273438 2.37072 2.4545
C  -1.307501 -0.725845 -2.520579
C  -4.122231 0.640605 0.987524
C  -2.684197 2.151563 -0.355999
H  -1.002799 -0.790014 2.431481
H  2.873976 -2.12454 -1.645157
H  4.288125 -1.326862 -0.985095
H  3.612521 -2.717955 -0.155326
H  2.076296 3.03002 1.513167
H  0.027169 3.338355 2.870616
H  -1.38342 -0.263512 -3.49129
H  -4.365354 1.510665 1.592677
H  -3.328068 0.074575 1.472606
H  -5.013138 0.024047 0.923537
H  -2.606102 2.616895 -1.334627
H  -1.710278 1.749612 -0.068513
H  -2.961698 2.925424 0.355692
elementType: Br S F O N C H
totalener: -4548.40091279 hartree
nucrepener: 3541.06889629 hartree
electener: -8089.46980907 hartree
twoeener: 5250.38138190 hartree
cpcmener: -0.02730999 hartree
kineticenergy: 4538.34677983 hartree
xcener: -216.147121647792 hartree
chargesum: 0.0000000
charge: 0.003449 0.874652 0.866359 -0.218202 -0.469866 -0.460530 -0.462084 -0.449228 -0.049007 0.056342 -0.273272 -0.154764 -0.342242 0.033799 0.035934 0.005295 -0.128586 0.108774 -0.244074 -0.207359 -0.094416 0.269815 -0.192547 0.135428 -0.164474 -0.179126 0.168899 0.112180 0.095846 0.114079 0.144759 0.154005 0.186532 0.120552 0.107242 0.135201 0.148887 0.085756 0.125994
qa: 0.0034 0.8747 0.8664 -0.2182 -0.4699 -0.4605 -0.4621 -0.4492 -0.0490 0.0563 -0.2733 -0.1548 -0.3422 0.0338 0.0359 0.0053 -0.1286 0.1088 -0.2441 -0.2074 -0.0944 0.2698 -0.1925 0.1354 -0.1645 -0.1791 0.1689 0.1122 0.0958 0.1141 0.1448 0.1540 0.1865 0.1206 0.1072 0.1352 0.1489 0.0858 0.1260
va: 1.2760 5.7794 6.0065 1.0577 2.0299 2.0441 2.0441 2.0538 3.2369 3.3467 2.9437 3.0827 3.0583 3.8614 3.7119 3.6989 4.0060 4.1352 3.8890 3.9150 3.9057 3.9245 3.9581 4.0177 3.8816 3.8962 1.0150 1.0063 1.0118 1.0010 1.0063 0.9983 0.9899 0.9927 0.9946 1.0093 1.0052 0.9956 0.9933
dispcorr: -0.027627601 hartree
energy: -4548.428540389221
dipole: -46.16574 46.34309 0.17735 -7.19262 10.04171 2.84908 2.21964 -2.13987 0.07977
magnitude: 2.85571 au
magnitude: 7.25864 debye
