program: Orca
programVersion: 4.2.1
elementType: Br S S F O O O O N N N N N C C C C C C C C C C C C C H H H H H H H H H H H H H
charge: 0
multiplicity: 1
keywords: wb97x-d3
keywords: def2-TZVPP
keywords: def2/J RIJCOSX GRIDX6 NOFINALGRIDX
keywords: grid4 nofinalgrid
keywords: scfconv7
keywords: smallprint printgap noloewdin
keywords: NOSOSCF
formula: C13H13BrFN5O4S2
InChI: InChI=1/C13H13BrFN5O4S2/c1-8-12(14)10-5-4-9(15)6-11(10)20(8)25(21,22)13-16-7-19(17-13)26(23,24)18(2)3/h4-7H,1-3H3
39 atoms
Br 3.937227 1.512282 -0.601275
S  0.358802 -2.574384 0.540734
S  -3.704165 0.149092 -1.527424
F  -1.488655 1.534813 3.643506
O  -0.397502 -2.818755 1.741583
O  1.156723 -3.60334 -0.06873
O  -3.602585 0.770259 -2.820288
O  -4.774913 -0.743161 -1.185427
N  1.348027 -1.2406 0.84016
N  -2.244958 -0.823718 -1.489461
N  -1.848579 -1.340874 -0.331478
N  -3.471934 1.215345 -0.348275
N  -0.359325 -1.774267 -1.959817
C  0.838372 -0.097215 1.476973
C  2.435927 -0.862888 0.01536
C  1.62365 0.990017 1.076511
C  2.608379 0.469974 0.176636
C  -0.722286 -1.897605 -0.675075
C  -0.228091 0.058577 2.355017
C  3.231813 -1.809081 -0.803453
C  1.353474 2.267096 1.557689
C  -0.46426 1.342515 2.798593
C  0.292974 2.445344 2.423681
C  -1.348357 -1.083484 -2.461896
C  -2.322364 2.109051 -0.465535
C  -3.880377 0.882159 1.01732
H  -0.843885 -0.755084 2.705011
H  2.674508 -2.184856 -1.661417
H  4.109859 -1.296549 -1.189329
H  3.578986 -2.660875 -0.221737
H  1.956404 3.114652 1.260054
H  0.051618 3.425806 2.811624
H  -1.458943 -0.762937 -3.485005
H  -1.407224 1.643841 -0.091006
H  -2.527282 2.997517 0.126745
H  -2.168806 2.426544 -1.493277
H  -4.008442 1.821128 1.5508
H  -3.137441 0.273628 1.530917
H  -4.834663 0.365671 1.022929
elementType: Br S F O N C H
totalener: -4548.40044163 hartree
nucrepener: 3560.92968476 hartree
electener: -8109.33012638 hartree
twoeener: 5270.09688475 hartree
cpcmener: -0.02696109 hartree
kineticenergy: 4538.35363532 hartree
xcener: -216.148722451913 hartree
chargesum: -0.0000000
charge: 0.003829 0.873921 0.863383 -0.218119 -0.470692 -0.458796 -0.462245 -0.449129 -0.048860 0.059536 -0.280343 -0.152927 -0.343862 0.010267 0.037139 0.016333 -0.134076 0.117037 -0.235507 -0.207241 -0.095509 0.289448 -0.201329 0.137232 -0.166485 -0.170060 0.166380 0.112110 0.096675 0.114214 0.144084 0.153017 0.186369 0.061202 0.132456 0.150052 0.121376 0.113435 0.135683
qa: 0.0038 0.8739 0.8634 -0.2181 -0.4707 -0.4588 -0.4622 -0.4491 -0.0489 0.0595 -0.2803 -0.1529 -0.3439 0.0103 0.0371 0.0163 -0.1341 0.1170 -0.2355 -0.2072 -0.0955 0.2894 -0.2013 0.1372 -0.1665 -0.1701 0.1664 0.1121 0.0967 0.1142 0.1441 0.1530 0.1864 0.0612 0.1325 0.1501 0.1214 0.1134 0.1357
va: 1.2775 5.7766 6.0061 1.0585 2.0291 2.0464 2.0430 2.0532 3.2286 3.3463 2.9455 3.0810 3.0554 3.8705 3.7038 3.6603 4.0161 4.1243 3.8760 3.9135 3.8942 3.8949 3.9431 4.0130 3.8991 3.8808 1.0186 1.0082 1.0120 1.0009 1.0073 0.9991 0.9895 0.9970 0.9917 1.0066 0.9912 0.9929 1.0096
dispcorr: -0.028144571 hartree
energy: -4548.428586197820
dipole: -42.74118 43.02845 0.28726 -7.53780 10.31840 2.78060 4.82440 -5.03143 -0.20703
magnitude: 2.80305 au
magnitude: 7.12479 debye
