program: Gaussian 09
title: 000069334
version: EM64L-G09RevD.01
frameworkgroup: C1[X(C8H10S)]
method: RPBEPBE
basis: SDD
operation: Freq
keyword: #pfreq=noraman
keyword: PBEPBE/SDD
title: #p freq=noraman PBEPBE/SDD
converged: YES YES NO NO
title: Mulliken charges:
elementType: S C C C C C C C C H H H H H H H H H H
charge: 0.172321 0.445826 -0.213198 -0.375541 -0.370345 -0.225827 -0.224644 -0.803533 -0.841628 0.231853 0.231735 0.251897 0.251435 0.225569 0.225234 0.237973 0.263665 0.263935 0.253272
chargesum: 0.00000
title: Mulliken charges with hydrogens summed into heavy atoms:
elementType: S C C C C C C C C
charge: 0.172321 0.445826 -0.213198 -0.143688 -0.138610 0.026070 0.026791 -0.114757 -0.060757
polarizability: 1.46239069e+02 -5.38541663e-02 9.24842461e+01 7.43052375e-01 1.36087342e-01 6.32688345e+01
1716.lowfreq: -14.8823 -11.1162 -5.8003 0.0024 0.0027 0.0033 6.5349 14.4619 83.9034
frequency: -11.4414 -4.7656 83.8857 137.9936 176.4693 233.4049 320.8792 357.5866 365.6653 409.1489 504.3549 605.6193 631.4443 643.1260 714.7544 787.5903 823.7549 849.4701 956.7709 963.3043 976.4982 985.3531 987.5314 1003.8753 1047.9258 1076.8215 1111.5133 1184.7676 1219.1807 1290.3581 1339.0280 1360.3966 1390.4503 1397.6540 1443.9720 1460.4105 1470.1158 1473.9916 1479.2060 1576.3207 1604.2588 2976.2472 3006.8956 3057.6747 3086.3131 3121.7469 3123.7420 3130.0654 3132.0021 3150.8450 3155.9935
redmass: 3.0201 1.0722 3.4392 1.0336 3.4281 4.5575 4.5469 2.8008 6.8982 2.8474 2.6306 5.4442 6.9758 7.1537 3.2678 4.9785 1.3707 1.2426 1.3015 1.1725 1.3823 1.4039 1.2837 4.0809 1.5694 2.9243 1.3083 1.1280 2.9087 1.2924 1.1315 5.0123 3.1970 1.2247 1.0569 1.0563 1.0900 1.0545 2.4929 6.2368 6.2402 1.0387 1.0278 1.0949 1.0998 1.0886 1.0886 1.1061 1.1037 1.0954 1.0967
irintensity: 1.8722 0.3216 1.1952 0.0489 0.7004 0.1490 0.3408 0.5830 0.4634 0.0012 30.7712 0.5613 0.0010 0.4209 1.1231 1.9293 53.7716 0.0096 1.6996 5.4857 0.0489 0.3075 23.6637 12.8130 20.8460 0.8434 11.2937 2.4837 2.5152 0.4665 0.5976 0.0089 2.4697 11.7995 18.2271 9.9044 14.4799 13.2251 40.7242 0.1940 2.6179 34.0691 33.2049 22.6611 17.9298 12.1975 17.7810 17.6922 14.9729 21.9060 0.3876
temp: 298.150 k
press: 1.00000 atm
elementType: 16 6 6 6 6 6 6 6 6 1 1 1 1 1 1 1 1 1 1
symmnumber: 1
zpe: 403060.0 jmol-1
zpe.correction: 0.153517 hartree
zpe.thermalcorrener: 0.161702 hartree
zpe.thermalcorrenthalpy: 0.162647 hartree
zpe.thermalcorrgfe: 0.120159 hartree
zpe.sumelectzpe: -708.240968 hartree
zpe.sumelectthermal: -708.232783 hartree
zpe.sumelectthermalent: -708.231839 hartree
zpe.sumelectthermalfe: -708.274327 hartree
dipole: -1.5525 -0.0652 1.7007
dipole: 2.3037
quadrupole: -55.2893 -57.0721 -64.7430
quadrupole: -0.1490 4.3670 0.0826
quadrupole: 3.7455 1.9627 -5.7082 -0.1490 4.3670 0.0826
hfenergy: -708.3944856 hartree
pointgroup: C01 [X(C8H10S1)]
dipole: -0.5862125 -0.2179651 0.6559575 debye
dipolederiv: -0.1019106 0.0297535 -0.0889453 0.0449522 -0.1531203 -0.060158 -0.117367 -0.0599104 0.0137946 0.4439432 0.0236776 -0.0536778 0.0063472 -0.0210246 0.00024 0.0124779 0.0011735 -0.0263243 0.4535297 0.0125899 -0.0272674 -0.0120862 -0.0356702 0.0521044 0.0540559 0.051818 -0.1848086 -0.1844049 -0.0789829 -0.0332624 -0.1101841 0.0412917 0.0655395 -0.0493917 0.0688823 -0.1394051 -0.1884165 0.0784491 0.0137847 0.1118394 0.0540639 0.0596524 0.0182376 0.0564414 -0.1470888 -0.1649952 0.0740939 0.0017811 -0.0313836 0.037589 0.0357356 -0.01136 0.0263392 -0.1001029 -0.1657389 -0.0660848 -0.0401277 0.0254743 0.0233665 0.0454908 0.0122674 0.055218 -0.0875396 -0.1768366 -0.010677 0.0197442 0.0112821 0.0789659 0.0025416 -0.0817424 0.0002824 0.0754086 -0.0548722 -0.0424682 0.1303049 -0.0442684 0.0552459 -0.0169106 0.1242352 -0.0161179 0.1098766 -0.0053662 0.0913866 0.0514516 0.0863087 -0.0331961 -0.0639445 0.0586986 -0.0733673 0.1217806 0.0000364 -0.1025733 -0.0069331 -0.102725 -0.0546595 -0.049169 0.0009602 -0.0396595 0.137868 0.0588399 -0.0911103 -0.0023543 -0.0781492 -0.0172525 -0.038527 0.0009149 -0.0377842 0.1319343 0.0540256 0.0798025 0.0492015 0.066893 -0.0043773 -0.0516752 0.044367 -0.0522054 0.122314 0.0357663 -0.0172173 0.0205555 -0.1057702 -0.1094234 0.0758936 0.0569945 0.0430919 0.087594 0.0355063 0.0063368 0.0293055 0.068808 -0.0077764 -0.130463 0.1051431 -0.0962446 -0.0115715 -0.0658808 0.0151898 -0.0669413 0.0279134 0.1026097 0.0431744 -0.1129889 0.0436584 -0.0587177 0.0975201 -0.0737778 -0.0114596 -0.0248455 -0.0930558 0.0837663 -0.0382276 0.0679047 -0.011166 0.0954947 0.0670618 0.0344584 0.0433723 0.0077942 -0.0710325 -0.0188944 -0.0564681 -0.1115596 -0.1662403 0.0045503 -0.0196186 0.0162216 0.1286293 0.0177412 -0.0583803 0.0169475 0.0777133 unknown
polarizability: 146.1821769|1.0547015|90.2685734|-2.0117728|7.7348279|65.5413992 unknown
InChI: InChI=1S/C8H10S/c1-7-3-5-8(9-2)6-4-7/h3-6H,1-2H3
charge 0 multiplicity 1
19 atoms
S  2.753941 0.160345 -0.727247
C  -1.869672 -0.141012 0.079867
C  0.939799 0.034918 -0.388911
C  -1.166808 1.070615 0.307435
C  -1.13641 -1.262856 -0.387603
C  0.224235 1.163155 0.074171
C  0.254214 -1.179288 -0.624681
C  -3.370257 -0.226558 0.300059
C  3.418509 -0.376411 0.963488
H  -1.712254 1.951218 0.668282
H  -1.658311 -2.209914 -0.571879
H  0.755038 2.105515 0.246421
H  0.807903 -2.048727 -0.994994
H  -3.677613 -1.239879 0.613369
H  -3.708726 0.487564 1.071144
H  -3.921136 0.009909 -0.631147
H  3.084132 -1.399975 1.191466
H  3.074753 0.322289 1.741343
H  4.517163 -0.346609 0.888016
