program: Orca
programVersion: 4.2.1
elementType: Br S S F O O O O N N N N N C C C C C C C C C C C C C H H H H H H H H H H H H H
charge: 0
multiplicity: 1
keywords: wb97x-d3
keywords: def2-TZVPP
keywords: def2/J RIJCOSX GRIDX6 NOFINALGRIDX
keywords: grid4 nofinalgrid
keywords: scfconv7
keywords: smallprint printgap noloewdin
keywords: NOSOSCF
formula: C13H13BrFN5O4S2
InChI: InChI=1/C13H13BrFN5O4S2/c1-8-12(14)10-5-4-9(15)6-11(10)20(8)25(21,22)13-16-7-19(17-13)26(23,24)18(2)3/h4-7H,1-3H3
39 atoms
Br 3.070964 0.1921 2.870518
S  0.917903 -1.470376 -1.998698
S  -4.175843 -0.556727 -0.682251
F  -0.48842 3.804429 -1.796131
O  1.609904 -2.726702 -1.98667
O  0.736259 -0.701008 -3.198213
O  -4.807155 -0.947409 -1.905455
O  -4.665496 -0.928217 0.616294
N  1.650677 -0.452257 -0.859567
N  -2.594923 -1.321832 -0.682308
N  -1.696746 -0.978675 -1.600537
N  -3.813927 1.015313 -0.725796
N  -0.816378 -2.42795 -0.12364
C  1.212992 0.864439 -0.679655
C  2.296969 -0.889962 0.316821
C  1.618284 1.269753 0.598098
C  2.296639 0.15365 1.180972
C  -0.656089 -1.670939 -1.223468
C  0.49719 1.709935 -1.520625
C  2.88152 -2.242099 0.497586
C  1.324158 2.550742 1.052754
C  0.213087 2.963317 -1.022811
C  0.60907 3.403216 0.235494
C  -2.057162 -2.187966 0.204064
C  -3.573444 1.670831 -2.008594
C  -3.1069 1.584687 0.414226
H  0.189251 1.435033 -2.517403
H  3.561425 -2.503228 -0.310587
H  3.440468 -2.263518 1.429639
H  2.112785 -3.012216 0.550253
H  1.64764 2.873353 2.033223
H  0.362072 4.406311 0.555033
H  -2.598144 -2.600825 1.039777
H  -4.162539 1.20869 -2.79332
H  -2.520067 1.63859 -2.285092
H  -3.887961 2.708533 -1.912799
H  -3.314718 2.652723 0.436584
H  -2.02536 1.446413 0.334028
H  -3.463838 1.157131 1.346633
totalener: -4548.37979771 hartree
nucrepener: 3539.63277474 hartree
electener: -8088.01257245 hartree
twoeener: 5248.80208879 hartree
kineticenergy: 4538.35234825 hartree
xcener: -216.143024823580 hartree
chargesum: -0.0000000
charge: 0.005544 0.854518 0.847823 -0.206462 -0.416317 -0.428055 -0.399451 -0.433607 -0.053250 0.054440 -0.261108 -0.159698 -0.309496 0.013260 0.027885 -0.004312 -0.127993 0.101887 -0.241867 -0.205973 -0.075189 0.270258 -0.179706 0.078325 -0.167616 -0.192190 0.164970 0.110114 0.092613 0.116058 0.127940 0.128513 0.175719 0.136200 0.106780 0.107445 0.111575 0.086088 0.144334
qa: 0.0055 0.8545 0.8478 -0.2065 -0.4163 -0.4281 -0.3995 -0.4336 -0.0532 0.0544 -0.2611 -0.1597 -0.3095 0.0133 0.0279 -0.0043 -0.1280 0.1019 -0.2419 -0.2060 -0.0752 0.2703 -0.1797 0.0783 -0.1676 -0.1922 0.1650 0.1101 0.0926 0.1161 0.1279 0.1285 0.1757 0.1362 0.1068 0.1074 0.1116 0.0861 0.1443
va: 1.2779 5.7955 6.0166 1.0728 2.0892 2.0767 2.1033 2.0689 3.2480 3.3346 2.9207 3.0772 3.0584 3.9130 3.7310 3.7544 4.0117 4.1070 3.8879 3.9266 3.9207 3.9302 3.9560 4.0428 3.8967 3.9147 1.0191 1.0028 1.0114 1.0074 1.0137 1.0076 0.9937 1.0113 0.9925 0.9936 0.9965 0.9945 1.0076
dispcorr: -0.027410406 hartree
energy: -4548.407208115160
dipole: -37.88687 37.48415 -0.40272 3.23488 -2.02965 1.20523 -26.66594 27.96330 1.29735
magnitude: 1.81601 au
magnitude: 4.61593 debye
