program: Orca
programVersion: 4.2.1
elementType: Br S S F O O O O N N N N N C C C C C C C C C C C C C H H H H H H H H H H H H H
charge: 0
multiplicity: 1
keywords: wb97x-d3
keywords: def2-TZVPP
keywords: def2/J RIJCOSX GRIDX6 NOFINALGRIDX
keywords: grid4 nofinalgrid
keywords: scfconv7
keywords: smallprint printgap noloewdin
keywords: NOSOSCF
formula: C13H13BrFN5O4S2
InChI: InChI=1/C13H13BrFN5O4S2/c1-8-12(14)10-5-4-9(15)6-11(10)20(8)25(21,22)13-16-7-19(17-13)26(23,24)18(2)3/h4-7H,1-3H3
39 atoms
Br 3.783283 1.7353 -0.199079
S  0.3651 -2.644038 0.278873
S  -3.939634 -0.139861 -1.642461
F  -1.858558 1.000378 3.688763
O  -0.398505 -3.056627 1.423739
O  1.244838 -3.534245 -0.42172
O  -3.833804 0.706661 -2.798259
O  -4.89213 -1.201075 -1.524867
N  1.253884 -1.27628 0.739113
N  -2.357293 -0.902121 -1.630239
N  -1.952243 -1.557932 -0.547099
N  -3.925627 0.739906 -0.289857
N  -0.320831 -1.4834 -2.092766
C  0.665704 -0.250391 1.487057
C  2.356601 -0.755832 0.027302
C  1.422284 0.908944 1.276045
C  2.468873 0.550313 0.369561
C  -0.733135 -1.887338 -0.87826
C  -0.455707 -0.249874 2.309563
C  3.217613 -1.553175 -0.881296
C  1.072558 2.098239 1.906543
C  -0.77514 0.953676 2.900374
C  -0.041475 2.121251 2.721663
C  -1.370437 -0.856854 -2.551593
C  -2.980047 1.844726 -0.201185
C  -4.295222 0.12555 0.982501
H  -1.045679 -1.130618 2.509459
H  3.59445 -2.45257 -0.398925
H  2.685951 -1.854707 -1.783073
H  4.069415 -0.948668 -1.182125
H  1.662043 2.992812 1.757558
H  -0.34434 3.027509 3.227896
H  -1.468479 -0.37305 -3.509632
H  -3.37603 2.567329 0.509919
H  -2.874001 2.344985 -1.159249
H  -2.000122 1.514523 0.153455
H  -3.424343 -0.271593 1.503076
H  -5.013885 -0.672425 0.831006
H  -4.761467 0.893593 1.59708
totalener: -4548.37985885 hartree
nucrepener: 3540.73132430 hartree
electener: -8089.11118314 hartree
twoeener: 5249.89745924 hartree
kineticenergy: 4538.35577253 hartree
xcener: -216.143437015472 hartree
chargesum: -0.0000000
charge: 0.006414 0.854440 0.847222 -0.206150 -0.428563 -0.416163 -0.433539 -0.399220 -0.056944 0.054531 -0.259926 -0.159540 -0.309312 0.013202 0.029865 -0.004283 -0.129280 0.101891 -0.243260 -0.206593 -0.072807 0.270245 -0.183344 0.078274 -0.191662 -0.167610 0.167500 0.110088 0.116577 0.092907 0.128187 0.129004 0.175606 0.111674 0.143521 0.086116 0.106569 0.136355 0.108008
qa: 0.0064 0.8544 0.8472 -0.2062 -0.4286 -0.4162 -0.4335 -0.3992 -0.0569 0.0545 -0.2599 -0.1595 -0.3093 0.0132 0.0299 -0.0043 -0.1293 0.1019 -0.2433 -0.2066 -0.0728 0.2702 -0.1833 0.0783 -0.1917 -0.1676 0.1675 0.1101 0.1166 0.0929 0.1282 0.1290 0.1756 0.1117 0.1435 0.0861 0.1066 0.1364 0.1080
va: 1.2796 5.7953 6.0179 1.0735 2.0761 2.0894 2.0690 2.1035 3.2486 3.3354 2.9209 3.0777 3.0585 3.9104 3.7235 3.7506 4.0158 4.1054 3.8867 3.9263 3.9205 3.9308 3.9547 4.0429 3.9157 3.8965 1.0180 1.0025 1.0079 1.0115 1.0134 1.0076 0.9937 0.9963 1.0080 0.9941 0.9916 1.0118 0.9934
dispcorr: -0.027408162 hartree
energy: -4548.407267008414
dipole: -44.64240 44.53427 -0.10813 -11.51701 13.34432 1.82731 2.11232 -2.03733 0.07499
magnitude: 1.83204 au
magnitude: 4.65668 debye
