program: Orca
programVersion: 4.2.1
elementType: Br S S F O O O O N N N N N C C C C C C C C C C C C C H H H H H H H H H H H H H
charge: 0
multiplicity: 1
keywords: wb97x-d3
keywords: def2-TZVPP
keywords: def2/J RIJCOSX GRIDX6 NOFINALGRIDX
keywords: grid4 nofinalgrid
keywords: scfconv7
keywords: smallprint printgap noloewdin
keywords: NOSOSCF
formula: C13H13BrFN5O4S2
InChI: InChI=1/C13H13BrFN5O4S2/c1-8-12(14)10-5-4-9(15)6-11(10)20(8)25(21,22)13-16-7-19(17-13)26(23,24)18(2)3/h4-7H,1-3H3
39 atoms
Br 3.819573 1.717874 -0.101899
S  0.355669 -2.642078 0.192814
S  -3.944178 -0.095086 -1.688005
F  -1.902581 0.922817 3.656242
O  -0.419676 -3.089047 1.316675
O  1.235203 -3.513484 -0.531425
O  -3.829366 0.802855 -2.803488
O  -4.882302 -1.174059 -1.635379
N  1.24964 -1.297308 0.706294
N  -2.351679 -0.834976 -1.677926
N  -1.957489 -1.534152 -0.618201
N  -3.969654 0.726718 -0.299269
N  -0.303903 -1.380016 -2.134305
C  0.655231 -0.287105 1.47041
C  2.36981 -0.7670 0.030003
C  1.423641 0.871685 1.304243
C  2.48521 0.528759 0.409025
C  -0.730728 -1.839181 -0.94468
C  -0.481559 -0.300658 2.27139
C  3.244206 -1.547802 -0.880169
C  1.069291 2.046643 1.958565
C  -0.804705 0.889254 2.887202
C  -0.060269 2.056081 2.752495
C  -1.351723 -0.742263 -2.581568
C  -4.345285 0.052084 0.940064
C  -3.051897 1.848339 -0.150681
H  -1.08019 -1.182816 2.437228
H  4.108443 -0.943936 -1.144685
H  3.601413 -2.46359 -0.413853
H  2.73111 -1.819734 -1.801843
H  1.666947 2.940963 1.844077
H  -0.367154 2.951252 3.275781
H  -1.439813 -0.21816 -3.51917
H  -4.854732 0.777846 1.571757
H  -3.472072 -0.332147 1.466483
H  -5.028961 -0.766289 0.741967
H  -2.062992 1.525094 0.185277
H  -3.465279 2.520203 0.599192
H  -2.960768 2.403104 -1.079889
totalener: -4548.37987514 hartree
nucrepener: 3537.98381677 hartree
electener: -8086.36369191 hartree
twoeener: 5247.17311321 hartree
kineticenergy: 4538.35234298 hartree
xcener: -216.142774318334 hartree
chargesum: 0.0000000
charge: 0.006497 0.854808 0.847508 -0.206613 -0.428346 -0.416752 -0.434088 -0.398898 -0.057338 0.054996 -0.259573 -0.159786 -0.309035 0.016575 0.029048 -0.004060 -0.128344 0.101182 -0.243418 -0.207093 -0.073900 0.266733 -0.181018 0.077704 -0.166680 -0.193223 0.167849 0.093025 0.109956 0.116625 0.128335 0.128890 0.175581 0.108302 0.104766 0.136411 0.088157 0.111111 0.144103
qa: 0.0065 0.8548 0.8475 -0.2066 -0.4283 -0.4168 -0.4341 -0.3989 -0.0573 0.0550 -0.2596 -0.1598 -0.3090 0.0166 0.0290 -0.0041 -0.1283 0.1012 -0.2434 -0.2071 -0.0739 0.2667 -0.1810 0.0777 -0.1667 -0.1932 0.1678 0.0930 0.1100 0.1166 0.1283 0.1289 0.1756 0.1083 0.1048 0.1364 0.0882 0.1111 0.1441
va: 1.2794 5.7963 6.0180 1.0727 2.0764 2.0889 2.0685 2.1038 3.2492 3.3343 2.9198 3.0785 3.0594 3.9089 3.7257 3.7532 4.0155 4.1064 3.8876 3.9269 3.9225 3.9346 3.9565 4.0440 3.8969 3.9158 1.0174 1.0113 1.0027 1.0074 1.0132 1.0075 0.9937 0.9937 0.9918 1.0116 0.9945 0.9959 1.0075
dispcorr: -0.027324011 hartree
energy: -4548.407199150423
dipole: -45.24161 45.11255 -0.12906 -11.51028 13.32706 1.81678 1.35947 -1.20791 0.15156
magnitude: 1.82765 au
magnitude: 4.64552 debye
