program: Orca
programVersion: 5.0.2
elementType: N N N N N C C C C C C C C C C C C C C C H H H H H H H H H H H H H H H H H H H H H H H H H
charge: 0
multiplicity: 1
keywords: wb97x-d3
keywords: def2-TZVPP
keywords: def2/J RIJCOSX
keywords: DEFGRID2
keywords: scfconv7
keywords: smallprint printgap noloewdin
keywords: NOSOSCF
formula: C15H25N5
InChI: InChI=1/C15H25N5/c1-3-5-6-7-8-9-10-12-13(4-2)19-15-17-11-18-20(15)14(12)16/h11H,3-10,16H2,1-2H3
45 atoms
N  -0.664552 -2.740677 0.850176
N  1.633413 -3.165855 0.552124
N  -1.750806 -0.784956 0.368716
N  -1.769019 -3.356356 1.298804
N  0.028335 -4.724247 1.441688
C  1.032434 2.827531 -0.098219
C  0.966379 1.404651 0.447059
C  -0.281708 3.333526 -0.6833
C  0.773813 0.338009 -0.634816
C  -0.199919 4.779363 -1.158883
C  0.63807 -1.051551 -0.078862
C  -1.453195 5.270502 -1.879614
C  1.727329 -1.944594 0.065374
C  -2.739569 5.220863 -1.057578
C  -0.603793 -1.483702 0.360074
C  3.105823 -1.552418 -0.392139
C  0.429348 -3.569002 0.936749
C  -2.686478 6.048267 0.219364
C  3.340643 -1.941877 -1.85073
C  -1.281023 -4.535286 1.634656
H  1.818578 2.891477 -0.858597
H  1.341203 3.499921 0.70759
H  1.885819 1.178876 0.993813
H  0.161557 1.332266 1.185883
H  -0.589059 2.705542 -1.526953
H  -1.067196 3.233686 0.074356
H  1.609063 0.383241 -1.335953
H  -0.101515 0.575573 -1.24919
H  0.024983 5.428882 -0.307377
H  0.652529 4.880611 -1.837474
H  -1.591999 4.680729 -2.791228
H  -1.28636 6.299775 -2.212173
H  -2.987824 4.184392 -0.811419
H  -3.562347 5.57738 -1.682587
H  3.82198 -2.076715 0.240235
H  3.281326 -0.484103 -0.253698
H  -1.947159 5.666103 0.924864
H  -2.427815 7.0872 0.006061
H  -3.649215 6.048512 0.730664
H  3.206158 -3.014543 -1.98363
H  4.353879 -1.687995 -2.161775
H  2.648346 -1.433287 -2.523336
H  -2.602141 -1.259811 0.61747
H  -1.806569 0.11257 -0.072431
H  -1.925568 -5.299688 2.041806
totalener: -860.51163781 hartree
nucrepener: 1549.78904641 hartree
electener: -2410.30068422 hartree
oneelecener: -4240.99981604 hartree
twoeener: 1830.69913181 hartree
kineticenergy: 856.59502891 hartree
xcener: -85.955068683310 hartree
chargesum: -0.0000000
charge: 0.147024 -0.296525 -0.271372 -0.401763 -0.306039 -0.123972 -0.123439 -0.124138 -0.211332 -0.142009 -0.089361 -0.141160 0.177788 -0.116910 0.225206 -0.150884 0.217429 -0.252249 -0.259708 0.097240 0.063701 0.075894 0.090395 0.078585 0.057330 0.057022 0.092685 0.083250 0.070647 0.074583 0.066737 0.076933 0.053432 0.074083 0.096087 0.067351 0.069940 0.080457 0.088591 0.104028 0.087658 0.072133 0.176876 0.160487 0.127288
qa: 0.1470 -0.2965 -0.2714 -0.4018 -0.3060 -0.1240 -0.1234 -0.1241 -0.2113 -0.1420 -0.0894 -0.1412 0.1778 -0.1169 0.2252 -0.1509 0.2174 -0.2522 -0.2597 0.0972 0.0637 0.0759 0.0904 0.0786 0.0573 0.0570 0.0927 0.0832 0.0706 0.0746 0.0667 0.0769 0.0534 0.0741 0.0961 0.0674 0.0699 0.0805 0.0886 0.1040 0.0877 0.0721 0.1769 0.1605 0.1273
va: 3.3376 3.0488 3.2727 2.7680 3.0625 3.8619 3.8130 3.8461 3.8329 3.9053 3.5666 3.8958 3.8893 3.8847 4.1490 3.9033 4.3498 3.9349 3.9150 4.0701 1.0126 1.0130 1.0211 1.0205 1.0113 1.0066 1.0111 1.0072 1.0045 1.0124 1.0123 1.0094 1.0033 1.0085 1.0245 1.0054 1.0006 1.0034 1.0075 1.0077 1.0059 1.0047 1.0392 1.0288 1.0000
dispcorr: -0.019266428 hartree
energy: -860.530904238641
dipole: -0.46610 -0.19885 -0.66495 47.14638 -44.77165 2.37473 -13.09554 12.26056 -0.83498
magnitude: 2.60359 au
magnitude: 6.61780 debye
