program: Orca
programVersion: 5.0.2
elementType: N N N N N C C C C C C C C C C C C C C C H H H H H H H H H H H H H H H H H H H H H H H H H
charge: 0
multiplicity: 1
keywords: wb97x-d3
keywords: def2-TZVPP
keywords: def2/J RIJCOSX
keywords: DEFGRID2
keywords: scfconv7
keywords: smallprint printgap noloewdin
keywords: NOSOSCF
formula: C15H25N5
InChI: InChI=1/C15H25N5/c1-3-5-6-7-8-9-10-12-13(4-2)19-15-17-11-18-20(15)14(12)16/h11H,3-10,16H2,1-2H3
45 atoms
N  -0.324693 -3.234449 1.203743
N  1.851315 -3.174047 0.310282
N  -2.029444 -1.791228 0.712567
N  -1.056139 -3.954324 2.068731
N  1.040702 -4.789725 1.898967
C  -0.569927 2.17155 -1.176246
C  -0.059394 0.969839 -0.392449
C  -0.368686 3.492714 -0.445571
C  -0.258223 -0.354662 -1.131749
C  -0.908876 4.692518 -1.214007
C  0.168856 -1.558715 -0.338126
C  -0.700032 6.011865 -0.48012
C  1.471265 -2.115383 -0.378832
C  -1.173575 7.240441 -1.252534
C  -0.75036 -2.15519 0.513812
C  2.572616 -1.495715 -1.196499
C  0.950029 -3.738624 1.100348
C  -2.677589 7.282367 -1.489532
C  3.580328 -0.774534 -0.303085
C  -0.177843 -4.864587 2.443777
H  -1.635013 2.037538 -1.39771
H  -0.067227 2.212354 -2.148453
H  1.003789 1.098333 -0.169529
H  -0.55853 0.928309 0.5820
H  -0.853265 3.443449 0.535647
H  0.698116 3.637675 -0.244961
H  0.27624 -0.319937 -2.081932
H  -1.309657 -0.457246 -1.423899
H  -0.424174 4.743953 -2.195313
H  -1.973831 4.537245 -1.412594
H  0.364314 6.124951 -0.251821
H  -1.211624 5.974338 0.487968
H  -0.650355 7.287971 -2.212435
H  -0.874684 8.137437 -0.704247
H  2.187557 -0.807277 -1.947709
H  3.080674 -2.298577 -1.732848
H  -3.225808 7.219494 -0.547488
H  -2.974446 8.209829 -1.979513
H  -3.017059 6.461637 -2.122058
H  3.113762 0.043534 0.247467
H  4.392283 -0.355583 -0.897326
H  4.008729 -1.464679 0.42172
H  -2.55247 -2.269946 1.426803
H  -2.356645 -0.897736 0.400553
H  -0.450375 -5.626807 3.158138
totalener: -860.51252009 hartree
nucrepener: 1516.39324864 hartree
electener: -2376.90576873 hartree
oneelecener: -4174.31629243 hartree
twoeener: 1797.41052371 hartree
kineticenergy: 856.59504650 hartree
xcener: -85.952628437886 hartree
chargesum: 0.0000000
charge: 0.144474 -0.309984 -0.270263 -0.402278 -0.307786 -0.108066 -0.129065 -0.111364 -0.183740 -0.111676 -0.084982 -0.110832 0.173048 -0.109205 0.234312 -0.161139 0.215285 -0.258196 -0.252161 0.098364 0.052045 0.061744 0.079986 0.065762 0.055601 0.059461 0.102268 0.081350 0.056987 0.055601 0.066142 0.058573 0.052334 0.069651 0.071708 0.091933 0.075200 0.087567 0.073305 0.069704 0.086430 0.107765 0.177392 0.160026 0.126720
qa: 0.1445 -0.3100 -0.2703 -0.4023 -0.3078 -0.1081 -0.1291 -0.1114 -0.1837 -0.1117 -0.0850 -0.1108 0.1730 -0.1092 0.2343 -0.1611 0.2153 -0.2582 -0.2522 0.0984 0.0520 0.0617 0.0800 0.0658 0.0556 0.0595 0.1023 0.0814 0.0570 0.0556 0.0661 0.0586 0.0523 0.0697 0.0717 0.0919 0.0752 0.0876 0.0733 0.0697 0.0864 0.1078 0.1774 0.1600 0.1267
va: 3.3425 3.0402 3.2784 2.7680 3.0617 3.8394 3.8066 3.9007 3.7837 3.8775 3.5664 3.8926 3.8746 3.9037 4.1189 3.9070 4.3533 3.9326 3.9128 4.0716 1.0155 1.0141 1.0233 1.0184 1.0111 1.0135 1.0119 1.0142 1.0104 1.0102 1.0131 1.0099 1.0096 1.0081 1.0117 1.0207 1.0025 1.0067 1.0014 1.0067 1.0055 1.0142 1.0394 1.0273 1.0001
dispcorr: -0.018196422 hartree
energy: -860.530716506699
dipole: -4.77839 3.47671 -1.30169 54.07047 -52.01513 2.05533 -15.29875 14.60778 -0.69097
magnitude: 2.52908 au
magnitude: 6.42840 debye
