program: Orca
programVersion: 5.0.2
elementType: N N N N N C C C C C C C C C C C C C C C H H H H H H H H H H H H H H H H H H H H H H H H H
charge: 0
multiplicity: 1
keywords: wb97x-d3
keywords: def2-TZVPP
keywords: def2/J RIJCOSX
keywords: DEFGRID2
keywords: scfconv7
keywords: smallprint printgap noloewdin
keywords: NOSOSCF
formula: C15H25N5
InChI: InChI=1/C15H25N5/c1-3-5-6-7-8-9-10-12-13(4-2)19-15-17-11-18-20(15)14(12)16/h11H,3-10,16H2,1-2H3
45 atoms
N  -0.618172 -2.551817 0.782762
N  1.581986 -3.115045 0.156356
N  -1.632588 -0.520002 0.477661
N  -1.685382 -3.105195 1.377061
N  0.025453 -4.581397 1.26152
C  1.392989 2.894066 -0.255309
C  1.247061 1.46144 0.250788
C  0.118348 3.528126 -0.81051
C  0.81664 0.465225 -0.829849
C  -1.015387 3.630492 0.204109
C  0.648868 -0.931301 -0.302103
C  -2.304194 4.229016 -0.35203
C  1.686626 -1.899114 -0.33179
C  -2.188086 5.679246 -0.808058
C  -0.544536 -1.291804 0.297895
C  3.008857 -1.542704 -0.963055
C  0.421695 -3.446161 0.711245
C  -3.529296 6.263907 -1.227685
C  4.072439 -2.620974 -0.853385
C  -1.230645 -4.31625 1.636054
H  2.165808 2.91933 -1.0299
H  1.769525 3.516389 0.561918
H  2.203534 1.132519 0.665848
H  0.543744 1.420327 1.086952
H  0.369636 4.526011 -1.178451
H  -0.228482 2.974981 -1.690165
H  1.546495 0.477445 -1.641486
H  -0.11389 0.800105 -1.301489
H  -1.24282 2.638917 0.609677
H  -0.67876 4.22252 1.062163
H  -3.081427 4.164436 0.41604
H  -2.659779 3.616531 -1.188739
H  -1.485182 5.757409 -1.641425
H  -1.763959 6.279662 0.002826
H  3.376623 -0.614105 -0.515142
H  2.837193 -1.302807 -2.01802
H  -3.968763 5.69641 -2.0497
H  -4.242796 6.249123 -0.402082
H  -3.431231 7.297846 -1.558376
H  3.759376 -3.542719 -1.338949
H  4.290368 -2.862475 0.185248
H  4.994149 -2.280431 -1.3254
H  -2.47538 -0.960811 0.806891
H  -1.713614 0.352427 -0.00915
H  -1.858231 -5.044676 2.126869
totalener: -860.51128779 hartree
nucrepener: 1558.27563056 hartree
electener: -2418.78691835 hartree
oneelecener: -4258.02400840 hartree
twoeener: 1839.23709005 hartree
kineticenergy: 856.59599928 hartree
xcener: -85.956825765769 hartree
chargesum: 0.0000000
charge: 0.147015 -0.307396 -0.278024 -0.399412 -0.307049 -0.162272 -0.125758 -0.119500 -0.213988 -0.158390 -0.116020 -0.122806 0.194754 -0.081644 0.240457 -0.131475 0.204734 -0.260910 -0.238687 0.096018 0.077041 0.077572 0.090434 0.083872 0.084097 0.066046 0.097872 0.082994 0.056693 0.076093 0.071050 0.054018 0.055424 0.058300 0.076599 0.076226 0.072860 0.074138 0.086430 0.089769 0.086038 0.078583 0.173640 0.167289 0.127276
qa: 0.1470 -0.3074 -0.2780 -0.3994 -0.3070 -0.1623 -0.1258 -0.1195 -0.2140 -0.1584 -0.1160 -0.1228 0.1948 -0.0816 0.2405 -0.1315 0.2047 -0.2609 -0.2387 0.0960 0.0770 0.0776 0.0904 0.0839 0.0841 0.0660 0.0979 0.0830 0.0567 0.0761 0.0711 0.0540 0.0554 0.0583 0.0766 0.0762 0.0729 0.0741 0.0864 0.0898 0.0860 0.0786 0.1736 0.1673 0.1273
va: 3.3401 3.0101 3.2651 2.7701 3.0657 3.9101 3.7997 3.8271 3.8320 3.8832 3.6329 3.8812 3.8247 3.8769 4.1199 3.9033 4.3600 3.9606 3.9643 4.0697 1.0097 1.0104 1.0212 1.0118 1.0133 1.0062 1.0143 1.0084 1.0219 1.0151 1.0096 1.0115 1.0084 1.0068 0.9989 1.0020 1.0024 1.0039 1.0060 1.0124 1.0118 1.0024 1.0407 1.0254 1.0000
dispcorr: -0.019402698 hartree
energy: -860.530690485050
dipole: -0.82286 0.23741 -0.58545 44.52261 -42.12823 2.39438 -10.78447 10.10580 -0.67867
magnitude: 2.55664 au
magnitude: 6.49846 debye
