program: Orca
programVersion: 5.0.2
elementType: N N N N N C C C C C C C C C C C C C C C H H H H H H H H H H H H H H H H H H H H H H H H H
charge: 0
multiplicity: 1
keywords: wb97x-d3
keywords: def2-TZVPP
keywords: def2/J RIJCOSX
keywords: DEFGRID2
keywords: scfconv7
keywords: smallprint printgap noloewdin
keywords: NOSOSCF
formula: C15H25N5
InChI: InChI=1/C15H25N5/c1-3-5-6-7-8-9-10-12-13(4-2)19-15-17-11-18-20(15)14(12)16/h11H,3-10,16H2,1-2H3
45 atoms
N  -0.337287 -2.105979 1.464622
N  0.087305 -2.072083 -0.851632
N  0.772065 -0.900842 3.059439
N  -1.148426 -2.708948 2.347224
N  -1.579616 -3.420127 0.242562
C  1.310113 2.528719 0.146783
C  1.944606 1.749049 1.29804
C  -0.134008 2.161341 -0.177382
C  2.419636 0.325837 0.966384
C  -0.732004 3.030938 -1.275135
C  1.343902 -0.691327 0.691619
C  -2.176805 2.661839 -1.590779
C  1.025703 -1.181594 -0.59993
C  -2.792426 3.457441 -2.737804
C  0.61826 -1.197302 1.759156
C  1.799663 -0.730575 -1.809066
C  -0.597403 -2.536151 0.186025
C  -2.920993 4.949011 -2.457057
C  3.07258 -1.554812 -1.996796
C  -1.863209 -3.477813 1.54799
H  1.931167 2.424083 -0.749915
H  1.342692 3.593169 0.399308
H  2.818102 2.303462 1.652062
H  1.242332 1.733733 2.138735
H  -0.210223 1.114378 -0.475151
H  -0.738798 2.256337 0.731448
H  3.042407 -0.033021 1.794747
H  3.105772 0.380788 0.120946
H  -0.66495 4.08259 -0.978858
H  -0.127695 2.933919 -2.184393
H  -2.788491 2.792284 -0.691172
H  -2.223237 1.595472 -1.831987
H  -3.782062 3.049091 -2.957657
H  -2.197851 3.305138 -3.643845
H  2.042616 0.331893 -1.751084
H  1.1537 -0.862073 -2.676501
H  -3.424891 5.463395 -3.275596
H  -3.500404 5.129812 -1.54965
H  -1.949533 5.426755 -2.326123
H  3.602241 -1.24899 -2.898892
H  2.830121 -2.612585 -2.09183
H  3.757831 -1.445736 -1.155112
H  0.140239 -1.308721 3.727364
H  1.38236 -0.163594 3.35214
H  -2.633777 -4.118957 1.948829
totalener: -860.50882309 hartree
nucrepener: 1612.93951567 hartree
electener: -2473.44833876 hartree
oneelecener: -4367.65833408 hartree
twoeener: 1894.20999532 hartree
kineticenergy: 856.59820361 hartree
xcener: -85.956433125483 hartree
chargesum: -0.0000000
charge: 0.148379 -0.284792 -0.269449 -0.400174 -0.303978 -0.149860 -0.136134 -0.118044 -0.211198 -0.112979 -0.111664 -0.108980 0.149692 -0.110427 0.253468 -0.138687 0.215859 -0.258432 -0.260800 0.096371 0.062713 0.082498 0.088897 0.057836 0.060811 0.067276 0.105206 0.082496 0.060032 0.055698 0.056869 0.076875 0.070174 0.052366 0.067561 0.097856 0.086247 0.074904 0.072454 0.088636 0.103524 0.074277 0.178122 0.161240 0.127260
qa: 0.1484 -0.2848 -0.2694 -0.4002 -0.3040 -0.1499 -0.1361 -0.1180 -0.2112 -0.1130 -0.1117 -0.1090 0.1497 -0.1104 0.2535 -0.1387 0.2159 -0.2584 -0.2608 0.0964 0.0627 0.0825 0.0889 0.0578 0.0608 0.0673 0.1052 0.0825 0.0600 0.0557 0.0569 0.0769 0.0702 0.0524 0.0676 0.0979 0.0862 0.0749 0.0725 0.0886 0.1035 0.0743 0.1781 0.1612 0.1273
va: 3.3288 3.0322 3.2823 2.7715 3.0642 3.9097 3.8731 3.8767 3.8503 3.8831 3.5160 3.8881 3.8377 3.9052 4.0943 3.8596 4.3482 3.9301 3.9235 4.0706 1.0059 1.0087 1.0090 1.0175 1.0166 1.0164 1.0002 1.0159 1.0117 1.0104 1.0099 1.0146 1.0084 1.0097 1.0089 1.0277 1.0067 1.0027 1.0015 1.0054 1.0063 1.0041 1.0391 1.0316 1.0002
dispcorr: -0.020903845 hartree
energy: -860.529726936340
dipole: 3.78540 -2.46343 1.32197 34.38521 -32.81984 1.56537 -14.35133 15.53630 1.18497
magnitude: 2.36688 au
magnitude: 6.01614 debye
