program: Orca
programVersion: 5.0.2
elementType: N N N N N C C C C C C C C C C C C C C C H H H H H H H H H H H H H H H H H H H H H H H H H
charge: 0
multiplicity: 1
keywords: wb97x-d3
keywords: def2-TZVPP
keywords: def2/J RIJCOSX
keywords: DEFGRID2
keywords: scfconv7
keywords: smallprint printgap noloewdin
keywords: NOSOSCF
formula: C15H25N5
InChI: InChI=1/C15H25N5/c1-3-5-6-7-8-9-10-12-13(4-2)19-15-17-11-18-20(15)14(12)16/h11H,3-10,16H2,1-2H3
45 atoms
N  -0.930212 -1.420098 0.701674
N  0.683185 -2.410121 -0.693461
N  -0.593751 0.295837 2.171254
N  -2.237137 -1.526571 0.990153
N  -1.631835 -3.054181 -0.565754
C  1.541091 2.539557 0.103066
C  2.66501 1.563912 0.458389
C  0.721181 2.164672 -1.128772
C  2.266258 0.376476 1.342019
C  -0.361813 3.188528 -1.468009
C  1.237151 -0.569841 0.781363
C  -1.525564 3.24973 -0.480075
C  1.548518 -1.54945 -0.195104
C  -2.425647 2.020225 -0.505173
C  -0.072852 -0.523289 1.237306
C  2.930596 -1.668918 -0.781041
C  -0.561726 -2.344281 -0.246278
C  -3.534552 2.078124 0.533786
C  2.953785 -1.232402 -2.244065
C  -2.590305 -2.521188 0.197771
H  1.980592 3.525265 -0.076919
H  0.889025 2.677513 0.972912
H  3.135536 1.202167 -0.46034
H  3.44825 2.106834 0.994305
H  1.40472 2.083326 -1.979813
H  0.281909 1.171771 -1.015414
H  1.927409 0.763811 2.307649
H  3.168921 -0.186154 1.591144
H  0.101285 4.177778 -1.541026
H  -0.758788 2.971164 -2.464091
H  -2.1319 4.133761 -0.699394
H  -1.148596 3.404297 0.537042
H  -1.836994 1.114577 -0.346333
H  -2.862717 1.91396 -1.502235
H  3.224997 -2.718116 -0.717974
H  3.665272 -1.100868 -0.211633
H  -4.206944 2.918295 0.355164
H  -4.129034 1.165145 0.532386
H  -3.127515 2.202984 1.540083
H  2.683366 -0.181247 -2.353162
H  2.248356 -1.8217 -2.827089
H  3.947446 -1.367182 -2.670698
H  -1.594249 0.283941 2.289685
H  -0.10844 1.135187 2.422903
H  -3.610536 -2.873672 0.182495
totalener: -860.50699457 hartree
nucrepener: 1690.81720796 hartree
electener: -2551.32420253 hartree
oneelecener: -4523.17052351 hartree
twoeener: 1971.84632098 hartree
kineticenergy: 856.59757931 hartree
xcener: -85.958514914180 hartree
chargesum: 0.0000000
charge: 0.179537 -0.307979 -0.257231 -0.404283 -0.302953 -0.137793 -0.126448 -0.133587 -0.233308 -0.138681 -0.061701 -0.137409 0.179117 -0.068817 0.162392 -0.149425 0.213342 -0.275658 -0.247506 0.104326 0.085987 0.045149 0.077452 0.088226 0.079208 0.075033 0.082560 0.103948 0.069938 0.075381 0.079295 0.049667 0.027734 0.070923 0.091377 0.071367 0.087261 0.103559 0.048999 0.060365 0.108363 0.088457 0.185428 0.161895 0.126492
qa: 0.1795 -0.3080 -0.2572 -0.4043 -0.3030 -0.1378 -0.1264 -0.1336 -0.2333 -0.1387 -0.0617 -0.1374 0.1791 -0.0688 0.1624 -0.1494 0.2133 -0.2757 -0.2475 0.1043 0.0860 0.0451 0.0775 0.0882 0.0792 0.0750 0.0826 0.1039 0.0699 0.0754 0.0793 0.0497 0.0277 0.0709 0.0914 0.0714 0.0873 0.1036 0.0490 0.0604 0.1084 0.0885 0.1854 0.1619 0.1265
va: 3.3099 3.0304 3.2702 2.7514 3.0667 3.8465 3.8486 3.8594 3.8941 3.9549 3.5260 3.8706 3.8413 3.8521 4.0897 3.8958 4.3493 3.9406 3.9130 4.0538 1.0111 1.0140 1.0083 1.0107 1.0127 1.0067 1.0117 1.0069 1.0100 1.0101 1.0140 1.0085 1.0261 1.0144 1.0208 1.0127 1.0077 1.0085 1.0076 1.0108 1.0160 1.0058 1.0393 1.0325 1.0000
dispcorr: -0.025189251 hartree
energy: -860.532183818271
dipole: 6.30963 -5.50067 0.80896 27.17349 -25.26699 1.90650 -5.02366 5.96693 0.94327
magnitude: 2.27572 au
magnitude: 5.78443 debye
