program: Orca
programVersion: 5.0.2
elementType: N N N N N C C C C C C C C C C C C C C C H H H H H H H H H H H H H H H H H H H H H H H H H
charge: 0
multiplicity: 1
keywords: wb97x-d3
keywords: def2-TZVPP
keywords: def2/J RIJCOSX
keywords: DEFGRID2
keywords: scfconv7
keywords: smallprint printgap noloewdin
keywords: NOSOSCF
formula: C15H25N5
InChI: InChI=1/C15H25N5/c1-3-5-6-7-8-9-10-12-13(4-2)19-15-17-11-18-20(15)14(12)16/h11H,3-10,16H2,1-2H3
45 atoms
N  -0.137496 -2.701537 1.686609
N  0.47921 -2.94724 -0.573675
N  0.196546 -0.842625 2.983489
N  -0.748477 -3.391768 2.660715
N  -0.664193 -4.600705 0.750017
C  1.076369 2.948014 0.533508
C  0.497557 1.541961 0.435541
C  0.064994 4.062837 0.281717
C  1.544467 0.457845 0.705573
C  -0.456956 4.123756 -1.149655
C  0.982616 -0.934968 0.669551
C  -1.409163 5.292127 -1.379408
C  0.993202 -1.739928 -0.499442
C  -1.87578 5.447824 -2.82437
C  0.370381 -1.453393 1.796747
C  1.631794 -1.205519 -1.756479
C  -0.084403 -3.433823 0.525752
C  -2.696455 4.273796 -3.342533
C  1.477451 -2.102358 -2.972233
C  -1.034383 -4.515903 2.032287
H  1.909554 3.04948 -0.170812
H  1.511795 3.081858 1.529389
H  -0.333416 1.435572 1.140353
H  0.06838 1.37221 -0.555321
H  -0.777387 3.953205 0.973363
H  0.53104 5.021878 0.527621
H  2.025482 0.649177 1.67287
H  2.355677 0.554275 -0.017968
H  0.391889 4.208792 -1.838165
H  -0.95857 3.185832 -1.401957
H  -0.916558 6.217627 -1.065028
H  -2.282461 5.180453 -0.727463
H  -1.005968 5.599998 -3.470808
H  -2.470509 6.361372 -2.904163
H  2.695549 -1.032635 -1.559862
H  1.216201 -0.216246 -1.97205
H  -2.114945 3.352235 -3.379949
H  -3.564682 4.088664 -2.707476
H  -3.062955 4.463417 -4.351543
H  1.95573 -1.640473 -3.836036
H  0.429475 -2.271289 -3.2128
H  1.931352 -3.077596 -2.810378
H  -0.134482 -1.39851 3.75456
H  0.704651 -0.004018 3.190377
H  -1.54569 -5.316392 2.545244
totalener: -860.51253019 hartree
nucrepener: 1542.41105614 hartree
electener: -2402.92358633 hartree
oneelecener: -4226.52777634 hartree
twoeener: 1823.60419001 hartree
kineticenergy: 856.59769293 hartree
xcener: -85.954831383542 hartree
chargesum: 0.0000000
charge: 0.146167 -0.307982 -0.273575 -0.399038 -0.306921 -0.127606 -0.108421 -0.123514 -0.211464 -0.117911 -0.097932 -0.118419 0.184217 -0.105544 0.239203 -0.132051 0.205029 -0.258758 -0.237776 0.096895 0.065616 0.067903 0.074836 0.068059 0.060139 0.071380 0.078622 0.094681 0.058509 0.061852 0.064492 0.060866 0.052495 0.068846 0.076767 0.077977 0.073056 0.076563 0.087846 0.078022 0.085625 0.090065 0.174799 0.159657 0.126727
qa: 0.1462 -0.3080 -0.2736 -0.3990 -0.3069 -0.1276 -0.1084 -0.1235 -0.2115 -0.1179 -0.0979 -0.1184 0.1842 -0.1055 0.2392 -0.1321 0.2050 -0.2588 -0.2378 0.0969 0.0656 0.0679 0.0748 0.0681 0.0601 0.0714 0.0786 0.0947 0.0585 0.0619 0.0645 0.0609 0.0525 0.0688 0.0768 0.0780 0.0731 0.0766 0.0878 0.0780 0.0856 0.0901 0.1748 0.1597 0.1267
va: 3.3429 3.0125 3.2554 2.7711 3.0658 3.8768 3.7730 3.9153 3.8596 3.8694 3.6298 3.8991 3.8205 3.9020 4.1091 3.9003 4.3609 3.9345 3.9644 4.0700 1.0126 1.0137 1.0216 1.0181 1.0105 1.0129 1.0112 1.0129 1.0089 1.0058 1.0137 1.0092 1.0096 1.0085 1.0016 0.9970 1.0013 1.0023 1.0071 1.0024 1.0117 1.0128 1.0389 1.0288 1.0002
dispcorr: -0.018247218 hartree
energy: -860.530777404457
dipole: -1.29621 1.99336 0.69714 44.04879 -41.85270 2.19609 -19.41044 20.28276 0.87232
magnitude: 2.46369 au
magnitude: 6.26221 debye
