program: Orca
programVersion: 5.0.2
elementType: N N N N N C C C C C C C C C C C C C C C H H H H H H H H H H H H H H H H H H H H H H H H H
charge: 0
multiplicity: 1
keywords: wb97x-d3
keywords: def2-TZVPP
keywords: def2/J RIJCOSX
keywords: DEFGRID2
keywords: scfconv7
keywords: smallprint printgap noloewdin
keywords: NOSOSCF
formula: C15H25N5
InChI: InChI=1/C15H25N5/c1-3-5-6-7-8-9-10-12-13(4-2)19-15-17-11-18-20(15)14(12)16/h11H,3-10,16H2,1-2H3
45 atoms
N  -0.95171 -1.638743 0.905433
N  0.454035 -2.222235 -0.89006
N  -0.486791 -0.104072 2.539194
N  -2.161835 -1.943318 1.398419
N  -1.741182 -3.122867 -0.486033
C  1.65464 2.260497 -0.575545
C  1.610302 1.920792 0.909087
C  1.095527 3.642307 -0.907242
C  2.066187 0.490436 1.230338
C  -0.396846 3.860622 -0.649829
C  1.106868 -0.562258 0.743108
C  -1.340082 2.978155 -1.476901
C  1.323896 -1.358935 -0.412323
C  -1.73597 1.636866 -0.856091
C  -0.083946 -0.743532 1.426957
C  2.629564 -1.25309 -1.160295
C  -0.693512 -2.354395 -0.237126
C  -2.610316 1.764364 0.383484
C  2.730823 -2.151867 -2.380296
C  -2.576196 -2.834403 0.516947
H  1.122221 1.500387 -1.15326
H  2.694931 2.216708 -0.914548
H  2.245893 2.626354 1.453458
H  0.596487 2.071848 1.29061
H  1.660187 4.394259 -0.346067
H  1.294264 3.850466 -1.962955
H  2.210337 0.39202 2.312994
H  3.058326 0.324286 0.809263
H  -0.618853 3.758484 0.416508
H  -0.608281 4.907882 -0.880186
H  -0.88807 2.80145 -2.458452
H  -2.260535 3.534917 -1.67685
H  -0.846733 1.050788 -0.615502
H  -2.274616 1.054171 -1.607638
H  3.445011 -1.481764 -0.465925
H  2.789102 -0.21233 -1.4557
H  -2.097026 2.279282 1.196812
H  -3.521406 2.324245 0.16416
H  -2.906845 0.784733 0.758889
H  1.95221 -1.928318 -3.106777
H  2.630886 -3.202184 -2.114445
H  3.698407 -2.012105 -2.862498
H  -1.332156 -0.416245 2.987041
H  0.167852 0.430549 3.077121
H  -3.54724 -3.295171 0.617878
totalener: -860.50684445 hartree
nucrepener: 1689.62757712 hartree
electener: -2550.13442157 hartree
oneelecener: -4521.12185724 hartree
twoeener: 1970.98743566 hartree
kineticenergy: 856.59334479 hartree
xcener: -85.961557185641 hartree
chargesum: -0.0000000
charge: 0.178130 -0.301855 -0.243099 -0.405327 -0.302951 -0.127984 -0.121897 -0.165710 -0.199870 -0.144946 -0.058906 -0.138902 0.187696 -0.041957 0.136975 -0.126859 0.195110 -0.261589 -0.241229 0.102004 0.075815 0.083336 0.081804 0.050850 0.068332 0.074546 0.092377 0.087078 0.064710 0.081041 0.073143 0.072614 -0.013205 0.082280 0.078534 0.084766 0.060094 0.086521 0.082184 0.086496 0.088391 0.079196 0.175398 0.159624 0.127242
qa: 0.1781 -0.3019 -0.2431 -0.4053 -0.3030 -0.1280 -0.1219 -0.1657 -0.1999 -0.1449 -0.0589 -0.1389 0.1877 -0.0420 0.1370 -0.1269 0.1951 -0.2616 -0.2412 0.1020 0.0758 0.0833 0.0818 0.0508 0.0683 0.0745 0.0924 0.0871 0.0647 0.0810 0.0731 0.0726 -0.0132 0.0823 0.0785 0.0848 0.0601 0.0865 0.0822 0.0865 0.0884 0.0792 0.1754 0.1596 0.1272
va: 3.3267 2.9972 3.2553 2.7579 3.0668 3.8510 3.8127 3.9590 3.8676 3.8693 3.5559 3.9024 3.7720 3.8781 4.1411 3.8883 4.3646 3.9254 3.9684 4.0576 0.9987 1.0044 1.0189 1.0200 1.0104 1.0091 1.0025 1.0172 1.0048 1.0077 1.0096 1.0074 1.0220 1.0119 0.9991 0.9979 1.0076 1.0106 1.0242 1.0119 1.0126 1.0021 1.0373 1.0289 0.9997
dispcorr: -0.025001503 hartree
energy: -860.531845952607
dipole: 8.29801 -7.34746 0.95055 26.91820 -25.35375 1.56445 -6.16291 7.55844 1.39553
magnitude: 2.30186 au
magnitude: 5.85087 debye
