program: Orca
programVersion: 5.0.2
elementType: N N N N N C C C C C C C C C C C C C C C H H H H H H H H H H H H H H H H H H H H H H H H H
charge: 0
multiplicity: 1
keywords: wb97x-d3
keywords: def2-TZVPP
keywords: def2/J RIJCOSX
keywords: DEFGRID2
keywords: scfconv7
keywords: smallprint printgap noloewdin
keywords: NOSOSCF
formula: C15H25N5
InChI: InChI=1/C15H25N5/c1-3-5-6-7-8-9-10-12-13(4-2)19-15-17-11-18-20(15)14(12)16/h11H,3-10,16H2,1-2H3
45 atoms
N  -0.578409 -3.126981 0.96792
N  1.742136 -2.856547 0.670354
N  -2.220266 -1.826319 0.041152
N  -1.440244 -3.915897 1.626614
N  0.696227 -4.531461 2.046505
C  -0.747929 2.234178 -1.42344
C  -0.36825 1.057874 -0.534497
C  -0.982559 3.521117 -0.642912
C  -0.145828 -0.237304 -1.319008
C  -1.419587 4.683149 -1.526683
C  0.143251 -1.420721 -0.438843
C  -1.771628 5.954096 -0.75643
C  1.459479 -1.852095 -0.128657
C  -0.632237 6.561729 0.059586
C  -0.9071 -2.096807 0.156211
C  2.635558 -1.135056 -0.742087
C  0.718604 -3.49934 1.220376
C  0.57312 6.968454 -0.777335
C  3.990714 -1.625523 -0.26275
C  -0.61051 -4.73175 2.248262
H  -1.652884 1.98466 -1.989425
H  0.035224 2.39772 -2.171834
H  0.540371 1.294509 0.027324
H  -1.146937 0.901346 0.21871
H  -1.743424 3.345141 0.125933
H  -0.066706 3.78147 -0.103102
H  0.665123 -0.091865 -2.03445
H  -1.023488 -0.436486 -1.946473
H  -0.639196 4.893614 -2.26468
H  -2.295442 4.376467 -2.10716
H  -2.611841 5.740822 -0.088235
H  -2.135716 6.70452 -1.465131
H  -0.317238 5.865854 0.84205
H  -1.015039 7.439787 0.586095
H  2.538674 -0.062784 -0.544448
H  2.573841 -1.231904 -1.83141
H  1.058334 6.109036 -1.242112
H  0.285601 7.653761 -1.57713
H  1.324605 7.471978 -0.168965
H  4.098961 -1.510259 0.814019
H  4.783456 -1.056566 -0.748623
H  4.137525 -2.679302 -0.489444
H  -2.873873 -2.490066 0.422482
H  -2.541158 -1.206127 -0.677443
H  -0.987761 -5.515931 2.887159
totalener: -860.51286414 hartree
nucrepener: 1525.28171558 hartree
electener: -2385.79457972 hartree
oneelecener: -4192.23263552 hartree
twoeener: 1806.43805580 hartree
kineticenergy: 856.59764353 hartree
xcener: -85.955348286489 hartree
chargesum: 0.0000000
charge: 0.145528 -0.308222 -0.274447 -0.398915 -0.307023 -0.115300 -0.109053 -0.114902 -0.187533 -0.129940 -0.115547 -0.143490 0.192497 -0.119369 0.240900 -0.132855 0.204698 -0.252561 -0.238118 0.096078 0.051409 0.063397 0.072076 0.071229 0.061390 0.060226 0.092748 0.077421 0.067386 0.070683 0.067330 0.074605 0.060027 0.071650 0.076462 0.077041 0.069548 0.078416 0.088851 0.086074 0.078315 0.089284 0.174695 0.159895 0.127411
qa: 0.1455 -0.3082 -0.2744 -0.3989 -0.3070 -0.1153 -0.1091 -0.1149 -0.1875 -0.1299 -0.1155 -0.1435 0.1925 -0.1194 0.2409 -0.1329 0.2047 -0.2526 -0.2381 0.0961 0.0514 0.0634 0.0721 0.0712 0.0614 0.0602 0.0927 0.0774 0.0674 0.0707 0.0673 0.0746 0.0600 0.0717 0.0765 0.0770 0.0695 0.0784 0.0889 0.0861 0.0783 0.0893 0.1747 0.1599 0.1274
va: 3.3439 3.0107 3.2568 2.7713 3.0660 3.8491 3.7828 3.8704 3.8344 3.8793 3.6554 3.9042 3.8092 3.8869 4.1063 3.9026 4.3610 3.9334 3.9648 4.0700 1.0151 1.0144 1.0204 1.0236 1.0116 1.0107 1.0144 1.0099 1.0041 1.0129 1.0116 1.0085 1.0037 1.0086 0.9971 1.0015 1.0006 1.0032 1.0072 1.0117 1.0023 1.0128 1.0394 1.0285 1.0000
dispcorr: -0.018200202 hartree
energy: -860.531064343429
dipole: 1.00330 -2.30027 -1.29697 50.34486 -48.68390 1.66096 -14.60945 13.31779 -1.29166
magnitude: 2.47170 au
magnitude: 6.28256 debye
