program: Orca
programVersion: 5.0.2
elementType: N N N N N C C C C C C C C C C C C C C C H H H H H H H H H H H H H H H H H H H H H H H H H
charge: 0
multiplicity: 1
keywords: wb97x-d3
keywords: def2-TZVPP
keywords: def2/J RIJCOSX
keywords: DEFGRID2
keywords: scfconv7
keywords: smallprint printgap noloewdin
keywords: NOSOSCF
formula: C15H25N5
InChI: InChI=1/C15H25N5/c1-3-5-6-7-8-9-10-12-13(4-2)19-15-17-11-18-20(15)14(12)16/h11H,3-10,16H2,1-2H3
45 atoms
N  0.29033 -2.891224 1.781565
N  -0.331291 -2.892192 -0.490325
N  0.95684 -1.073139 3.002238
N  0.396833 -3.742653 2.81271
N  -0.331705 -4.814787 0.957814
C  -0.249544 2.934909 1.099439
C  -0.510857 1.431253 1.067408
C  0.112944 3.572218 -0.241599
C  0.683638 0.602828 0.589065
C  -0.934067 3.363417 -1.330185
C  0.417831 -0.876722 0.624043
C  -0.632536 4.088139 -2.63924
C  -0.054863 -1.603942 -0.496675
C  -0.689284 5.609636 -2.54718
C  0.575607 -1.571085 1.812541
C  -0.229882 -0.927826 -1.82879
C  -0.151522 -3.540286 0.653341
C  -0.488165 6.286228 -3.895669
C  1.06929 -0.933751 -2.63326
C  0.010386 -4.871206 2.249022
H  0.550926 3.144474 1.816813
H  -1.140439 3.431553 1.495295
H  -0.800004 1.100001 2.06887
H  -1.372373 1.207641 0.432475
H  0.262364 4.641691 -0.073544
H  1.079049 3.195867 -0.594425
H  1.565206 0.848678 1.194619
H  0.964866 0.903487 -0.420672
H  -1.029649 2.294713 -1.543463
H  -1.914821 3.680283 -0.958193
H  -1.350314 3.756274 -3.396324
H  0.35285 3.781642 -3.008703
H  0.0680 5.973839 -1.847941
H  -1.655343 5.90825 -2.127885
H  -0.593529 0.094668 -1.709819
H  -0.996129 -1.475963 -2.376239
H  0.477864 6.023502 -4.32973
H  -1.258685 5.986778 -4.607995
H  -0.524688 7.372344 -3.809073
H  0.922452 -0.47104 -3.609128
H  1.41345 -1.95489 -2.792678
H  1.866619 -0.390702 -2.124049
H  1.15479 -1.722126 3.745546
H  1.343751 -0.150839 3.059796
H  -0.020673 -5.786891 2.819869
totalener: -860.51121971 hartree
nucrepener: 1564.29716727 hartree
electener: -2424.80838698 hartree
oneelecener: -4270.11691983 hartree
twoeener: 1845.30853286 hartree
kineticenergy: 856.59539711 hartree
xcener: -85.955424243956 hartree
chargesum: -0.0000000
charge: 0.144412 -0.292747 -0.271884 -0.401900 -0.305957 -0.161280 -0.124970 -0.125801 -0.202033 -0.139759 -0.087612 -0.123175 0.146415 -0.084297 0.229359 -0.104500 0.218058 -0.261138 -0.262902 0.097427 0.068343 0.078531 0.088905 0.088234 0.082323 0.065583 0.084146 0.079582 0.071282 0.070860 0.069263 0.057212 0.052950 0.056058 0.041060 0.097343 0.073625 0.074183 0.085198 0.088720 0.105816 0.073380 0.175215 0.159526 0.126946
qa: 0.1444 -0.2927 -0.2719 -0.4019 -0.3060 -0.1613 -0.1250 -0.1258 -0.2020 -0.1398 -0.0876 -0.1232 0.1464 -0.0843 0.2294 -0.1045 0.2181 -0.2611 -0.2629 0.0974 0.0683 0.0785 0.0889 0.0882 0.0823 0.0656 0.0841 0.0796 0.0713 0.0709 0.0693 0.0572 0.0529 0.0561 0.0411 0.0973 0.0736 0.0742 0.0852 0.0887 0.1058 0.0734 0.1752 0.1595 0.1269
va: 3.3409 3.0521 3.2633 2.7687 3.0626 3.8999 3.7900 3.8401 3.8328 3.9001 3.5621 3.9041 3.9261 3.8746 4.1511 3.8917 4.3487 3.9599 3.9131 4.0707 1.0105 1.0104 1.0232 1.0093 1.0141 1.0048 1.0089 1.0153 1.0023 1.0143 1.0096 1.0113 1.0093 1.0070 1.0072 1.0325 1.0026 1.0039 1.0056 1.0060 1.0070 1.0035 1.0395 1.0293 1.0002
dispcorr: -0.019995287 hartree
energy: -860.531214996499
dipole: -0.61007 1.36414 0.75407 48.23204 -45.93882 2.29322 -21.23012 21.92578 0.69565
magnitude: 2.51225 au
magnitude: 6.38563 debye
