program: Orca
programVersion: 5.0.2
elementType: N N N N N C C C C C C C C C C C C C C C H H H H H H H H H H H H H H H H H H H H H H H H H
charge: 0
multiplicity: 1
keywords: wb97x-d3
keywords: def2-TZVPP
keywords: def2/J RIJCOSX
keywords: DEFGRID2
keywords: scfconv7
keywords: smallprint printgap noloewdin
keywords: NOSOSCF
formula: C15H25N5
InChI: InChI=1/C15H25N5/c1-3-5-6-7-8-9-10-12-13(4-2)19-15-17-11-18-20(15)14(12)16/h11H,3-10,16H2,1-2H3
45 atoms
N  0.104843 -3.101843 1.73283
N  1.052735 -3.264949 -0.41637
N  -1.113895 -1.339942 2.542659
N  0.002915 -3.817371 2.862961
N  1.22616 -4.92741 1.315726
C  -0.519269 2.566229 0.491548
C  0.051375 1.168633 0.706253
C  -0.430794 3.069506 -0.944943
C  -0.742085 0.063899 -0.0013
C  -0.919119 4.504429 -1.098697
C  -0.21369 -1.318085 0.268485
C  -0.804986 5.029202 -2.525038
C  0.534392 -2.079001 -0.666495
C  -1.35828 6.438676 -2.716628
C  -0.435867 -1.884099 1.514741
C  0.809959 -1.56023 -2.052549
C  0.843729 -3.775158 0.790279
C  -0.607219 7.510535 -1.937567
C  2.005664 -0.611394 -2.097575
C  0.696622 -4.893397 2.542849
H  0.015576 3.264908 1.14168
H  -1.563838 2.592278 0.82302
H  1.088457 1.138369 0.361657
H  0.096388 0.959427 1.778221
H  0.608211 3.000016 -1.286463
H  -1.00999 2.422462 -1.611452
H  -0.751957 0.252828 -1.073913
H  -1.797177 0.132479 0.296847
H  -1.963239 4.569184 -0.772014
H  -0.351171 5.145688 -0.417815
H  -1.331752 4.34587 -3.198511
H  0.244968 5.00732 -2.836939
H  -2.415263 6.453534 -2.433596
H  -1.330133 6.686252 -3.780814
H  -0.071322 -1.070051 -2.47136
H  1.016542 -2.427104 -2.679246
H  -0.692416 7.370447 -0.85965
H  0.455713 7.505583 -2.186297
H  -0.991879 8.505119 -2.163924
H  2.230868 -0.328123 -3.125666
H  2.891387 -1.089681 -1.680507
H  1.824712 0.305797 -1.537152
H  -1.312017 -1.927543 3.335926
H  -1.716469 -0.556007 2.377481
H  0.820705 -5.696688 3.253441
totalener: -860.51121970 hartree
nucrepener: 1535.54316024 hartree
electener: -2396.05437994 hartree
oneelecener: -4212.60828653 hartree
twoeener: 1816.55390660 hartree
kineticenergy: 856.59687592 hartree
xcener: -85.953689245816 hartree
chargesum: 0.0000000
charge: 0.144871 -0.287600 -0.273887 -0.401091 -0.305431 -0.099236 -0.170808 -0.114320 -0.189106 -0.126517 -0.127329 -0.104116 0.193061 -0.110334 0.235550 -0.156470 0.218537 -0.258047 -0.260868 0.097658 0.074787 0.054124 0.093403 0.091055 0.061206 0.056394 0.082861 0.090656 0.057725 0.058697 0.063953 0.059314 0.052138 0.069286 0.076817 0.098733 0.073586 0.076194 0.087133 0.089990 0.104195 0.062446 0.172138 0.161515 0.127134
qa: 0.1449 -0.2876 -0.2739 -0.4011 -0.3054 -0.0992 -0.1708 -0.1143 -0.1891 -0.1265 -0.1273 -0.1041 0.1931 -0.1103 0.2356 -0.1565 0.2185 -0.2580 -0.2609 0.0977 0.0748 0.0541 0.0934 0.0911 0.0612 0.0564 0.0829 0.0907 0.0577 0.0587 0.0640 0.0593 0.0521 0.0693 0.0768 0.0987 0.0736 0.0762 0.0871 0.0900 0.1042 0.0624 0.1721 0.1615 0.1271
va: 3.3441 3.0525 3.2600 2.7682 3.0623 3.8351 3.8357 3.8895 3.7796 3.9006 3.6229 3.8871 3.8579 3.9042 4.1190 3.8662 4.3453 3.9327 3.9132 4.0704 1.0140 1.0120 1.0090 1.0285 1.0099 1.0147 1.0253 1.0073 1.0087 1.0111 1.0136 1.0104 1.0095 1.0082 1.0054 1.0260 1.0014 1.0026 1.0068 1.0071 1.0068 1.0087 1.0413 1.0258 1.0000
dispcorr: -0.019098548 hartree
energy: -860.530318246734
dipole: -5.51493 4.23337 -1.28156 53.18873 -51.04628 2.14245 -19.32360 19.54635 0.22275
magnitude: 2.50642 au
magnitude: 6.37080 debye
