program: Orca
programVersion: 5.0.2
elementType: N N N N N C C C C C C C C C C C C C C C H H H H H H H H H H H H H H H H H H H H H H H H H
charge: 0
multiplicity: 1
keywords: wb97x-d3
keywords: def2-TZVPP
keywords: def2/J RIJCOSX
keywords: DEFGRID2
keywords: scfconv7
keywords: smallprint printgap noloewdin
keywords: NOSOSCF
formula: C15H25N5
InChI: InChI=1/C15H25N5/c1-3-5-6-7-8-9-10-12-13(4-2)19-15-17-11-18-20(15)14(12)16/h11H,3-10,16H2,1-2H3
45 atoms
N  -0.273486 -3.050526 1.416221
N  1.430177 -3.227584 -0.200714
N  -1.190344 -1.105544 2.207025
N  -1.053231 -3.839428 2.170153
N  0.320926 -5.077201 0.866881
C  -0.361261 2.492707 -0.618798
C  -0.409041 0.974915 -0.499421
C  -1.431576 3.04463 -1.553056
C  0.64163 0.419486 0.465273
C  -1.329449 4.545131 -1.811587
C  0.62193 -1.079987 0.564159
C  -1.528865 5.409383 -0.57074
C  1.456021 -1.913816 -0.226237
C  -1.630166 6.903573 -0.867428
C  -0.282312 -1.698282 1.40958
C  2.455475 -1.283677 -1.163868
C  0.562847 -3.800023 0.62547
C  -0.367967 7.502942 -1.473334
C  3.238608 -2.273366 -2.008653
C  -0.644188 -5.035152 1.791501
H  0.62774 2.796312 -0.980255
H  -0.466398 2.938155 0.37582
H  -1.406318 0.658373 -0.177823
H  -0.260929 0.523681 -1.485205
H  -1.369972 2.517734 -2.510285
H  -2.421674 2.811563 -1.146327
H  0.500501 0.871239 1.454968
H  1.630505 0.760949 0.155129
H  -0.358223 4.761181 -2.267179
H  -2.08002 4.823521 -2.558506
H  -0.712311 5.242011 0.139045
H  -2.442984 5.088108 -0.060413
H  -1.866825 7.432115 0.059661
H  -2.476506 7.080873 -1.538077
H  3.149723 -0.675567 -0.573871
H  1.934045 -0.573055 -1.813142
H  -0.134471 7.068065 -2.445484
H  -0.472391 8.57831 -1.618517
H  0.495922 7.342195 -0.825505
H  3.932824 -1.738606 -2.657039
H  2.580611 -2.873321 -2.6342
H  3.810181 -2.962054 -1.390166
H  -1.681624 -1.681184 2.870617
H  -1.128855 -0.121934 2.388071
H  -1.081765 -5.92525 2.217594
totalener: -860.51260936 hartree
nucrepener: 1521.25356772 hartree
electener: -2381.76617709 hartree
oneelecener: -4184.16987378 hartree
twoeener: 1802.40369669 hartree
kineticenergy: 856.59397157 hartree
xcener: -85.954197465150 hartree
chargesum: -0.0000000
charge: 0.145085 -0.307493 -0.274808 -0.399101 -0.307108 -0.106272 -0.126905 -0.130107 -0.178441 -0.133504 -0.119300 -0.109182 0.185857 -0.117594 0.246369 -0.130667 0.204544 -0.254183 -0.238027 0.097240 0.062634 0.054028 0.072845 0.073284 0.071755 0.062342 0.076713 0.091591 0.061597 0.074445 0.057894 0.067636 0.066830 0.054864 0.076096 0.077293 0.075483 0.086861 0.074673 0.078593 0.085955 0.088906 0.174749 0.159956 0.126575
qa: 0.1451 -0.3075 -0.2748 -0.3991 -0.3071 -0.1063 -0.1269 -0.1301 -0.1784 -0.1335 -0.1193 -0.1092 0.1859 -0.1176 0.2464 -0.1307 0.2045 -0.2542 -0.2380 0.0972 0.0626 0.0540 0.0728 0.0733 0.0718 0.0623 0.0767 0.0916 0.0616 0.0744 0.0579 0.0676 0.0668 0.0549 0.0761 0.0773 0.0755 0.0869 0.0747 0.0786 0.0860 0.0889 0.1747 0.1600 0.1266
va: 3.3436 3.0103 3.2575 2.7716 3.0659 3.8233 3.8057 3.9196 3.8232 3.8891 3.6544 3.8691 3.8197 3.9159 4.1008 3.8999 4.3612 3.9320 3.9651 4.0701 1.0128 1.0122 1.0226 1.0200 1.0117 1.0112 1.0111 1.0150 1.0093 1.0111 1.0088 1.0111 1.0080 1.0096 1.0016 0.9974 1.0019 1.0071 1.0023 1.0022 1.0119 1.0126 1.0392 1.0288 1.0002
dispcorr: -0.018073517 hartree
energy: -860.530682880384
dipole: -1.55316 1.02498 -0.52818 51.48058 -49.10526 2.37532 -16.10468 16.63558 0.53091
magnitude: 2.49058 au
magnitude: 6.33054 debye
