program: Orca
programVersion: 5.0.2
elementType: N N N N N C C C C C C C C C C C C C C C H H H H H H H H H H H H H H H H H H H H H H H H H
charge: 0
multiplicity: 1
keywords: wb97x-d3
keywords: def2-TZVPP
keywords: def2/J RIJCOSX
keywords: DEFGRID2
keywords: scfconv7
keywords: smallprint printgap noloewdin
keywords: NOSOSCF
formula: C15H25N5
InChI: InChI=1/C15H25N5/c1-3-5-6-7-8-9-10-12-13(4-2)19-15-17-11-18-20(15)14(12)16/h11H,3-10,16H2,1-2H3
45 atoms
N  -0.914759 -1.440229 0.988267
N  0.354706 -1.948703 -0.927782
N  -0.292475 -0.032226 2.685173
N  -2.096463 -1.746505 1.543026
N  -1.840022 -2.807065 -0.439187
C  2.133197 2.54645 -0.156547
C  2.03784 1.944592 1.246186
C  0.911504 2.359141 -1.055226
C  2.273488 0.428576 1.336271
C  -0.295365 3.186054 -0.625013
C  1.188571 -0.460373 0.787719
C  -1.531075 2.956891 -1.493751
C  1.295274 -1.172092 -0.437777
C  -2.2005 1.595393 -1.313549
C  0.022769 -0.62074 1.5154
C  2.552454 -1.055469 -1.262097
C  -0.754945 -2.086255 -0.211877
C  -2.833461 1.405851 0.058177
C  2.523754 -1.826411 -2.569893
C  -2.596065 -2.565935 0.636935
H  3.021491 2.140807 -0.6516
H  2.322171 3.620013 -0.057979
H  2.796713 2.421241 1.87279
H  1.077094 2.207155 1.698079
H  1.18269 2.648674 -2.075298
H  0.639711 1.304071 -1.110252
H  2.443095 0.17098 2.389332
H  3.222527 0.197195 0.851214
H  -0.541883 2.98375 0.421536
H  -0.023452 4.245673 -0.662776
H  -1.253675 3.088419 -2.544435
H  -2.267873 3.737324 -1.279032
H  -1.486132 0.79004 -1.508216
H  -2.974337 1.48449 -2.077256
H  3.39999 -1.392499 -0.6558
H  2.746703 0.00209 -1.463138
H  -3.572389 2.184627 0.258108
H  -3.34049 0.444426 0.132262
H  -2.09881 1.44036 0.863437
H  3.464502 -1.684587 -3.102094
H  1.71383 -1.490268 -3.214276
H  2.382361 -2.892417 -2.40456
H  -1.111753 -0.36177 3.168819
H  0.424719 0.41303 3.225764
H  -3.569714 -3.0107 0.776866
totalener: -860.50715785 hartree
nucrepener: 1704.42627748 hartree
electener: -2564.93343533 hartree
oneelecener: -4550.78651571 hartree
twoeener: 1985.85308038 hartree
kineticenergy: 856.59699432 hartree
xcener: -85.960960535024 hartree
chargesum: -0.0000000
charge: 0.186499 -0.290702 -0.247933 -0.397042 -0.293540 -0.174720 -0.130000 -0.086537 -0.222252 -0.152938 -0.019280 -0.125598 0.151164 -0.112465 0.146538 -0.121328 0.171594 -0.262277 -0.241381 0.088531 0.076154 0.082815 0.087994 0.063045 0.085250 0.036449 0.094500 0.089241 0.066089 0.073689 0.065295 0.070324 0.059756 0.075154 0.081389 0.076252 0.086920 0.098522 0.047287 0.079726 0.087693 0.089096 0.175287 0.158961 0.126778
qa: 0.1865 -0.2907 -0.2479 -0.3970 -0.2935 -0.1747 -0.1300 -0.0865 -0.2223 -0.1529 -0.0193 -0.1256 0.1512 -0.1125 0.1465 -0.1213 0.1716 -0.2623 -0.2414 0.0885 0.0762 0.0828 0.0880 0.0630 0.0852 0.0364 0.0945 0.0892 0.0661 0.0737 0.0653 0.0703 0.0598 0.0752 0.0814 0.0763 0.0869 0.0985 0.0473 0.0797 0.0877 0.0891 0.1753 0.1590 0.1268
va: 3.3177 2.9669 3.2422 2.7476 3.0653 3.9396 3.8313 3.8351 3.8758 3.8984 3.5179 3.9095 3.7891 3.8768 4.1350 3.8832 4.3687 3.9226 3.9693 4.0587 1.0023 1.0081 1.0094 1.0176 1.0115 1.0216 1.0004 1.0164 1.0034 1.0140 1.0116 1.0088 1.0122 1.0122 1.0011 1.0027 1.0090 1.0103 1.0143 1.0023 1.0116 1.0127 1.0378 1.0292 1.0007
dispcorr: -0.025463687 hartree
energy: -860.532621538197
dipole: 8.17841 -7.04755 1.13086 23.72800 -22.38756 1.34044 -7.03791 8.49606 1.45815
magnitude: 2.28075 au
magnitude: 5.79721 debye
