program: Gaussian 09
title: 000074294
version: EM64L-G09RevD.01
frameworkgroup: C1[X(C16H13ClF3NS)]
method: RPBEPBE
basis: SDD
operation: Freq
keyword: #p
keyword: freq=noraman
keyword: PBEPBE/SDD
title: #p freq=noraman PBEPBE/SDD
converged: YES YES NO NO
title: Mulliken charges:
elementType: Cl S F F F N C C C C C C C C C C C C C C C C H H H H H H H H H H H H H
charge: -0.060556 0.237287 -0.164814 -0.165663 -0.169347 -0.243562 -0.462871 0.558518 0.511310 -0.375740 -0.384139 -0.340191 -0.431916 0.295329 -0.319197 -0.254203 -0.416684 -0.270762 -0.581419 -0.259965 -0.248801 0.236426 0.267586 0.245816 0.234084 0.271600 0.285785 0.232627 0.252406 0.271341 0.246732 0.277406 0.258686 0.230103 0.236786
chargesum: 0.00000
title: Mulliken charges with hydrogens summed into heavy atoms:
elementType: Cl S F F F N C C C C C C C C C C C C C C C C
charge: -0.060556 0.237287 -0.164814 -0.165663 -0.169347 -0.243562 0.050532 0.558518 0.511310 -0.375740 0.121545 -0.340191 -0.146131 0.295329 -0.086570 -0.001797 -0.145344 -0.024030 -0.045326 -0.029862 -0.012014 0.236426
polarizability: 3.10925937e+02 -2.05488640e+01 2.25899501e+02 -1.14810088e+01 8.19362919e+00 1.04631364e+02
1716.lowfreq: -13.5776 -7.7563 0.0011 0.0021 0.0021 3.0909 5.2324 23.5482 29.1800
frequency: -13.5202 23.3279 28.9966 56.0587 70.6565 71.7436 103.0123 119.0816 143.8629 178.8202 207.3741 228.9074 236.5519 252.2092 265.8597 330.8600 335.6120 360.8570 365.4137 394.0652 403.3715 420.3413 442.9198 450.3143 465.2586 487.0318 497.0538 532.0036 542.6657 593.8853 603.4455 624.5020 630.7324 652.8487 667.6091 700.6132 717.9836 724.2124 749.8403 772.3118 795.4490 823.9274 842.2923 846.8612 872.5175 899.3974 926.6246 946.7448 970.9860 979.4596 997.2883 1007.7248 1024.6822 1027.2182 1035.9837 1048.8368 1068.2372 1085.2205 1101.0445 1134.3286 1157.4508 1161.9850 1179.2243 1197.6994 1237.7511 1250.7782 1273.2133 1291.8321 1295.5717 1301.8414 1322.9291 1347.3480 1373.9193 1376.8471 1392.4176 1414.7471 1430.3626 1453.2076 1468.3626 1470.1352 1491.8393 1511.0434 1573.6221 1581.3128 1596.7048 1612.7647 2995.6582 3012.5190 3047.7578 3057.6085 3074.9929 3135.6715 3135.8949 3143.7759 3150.3971 3168.0674 3173.1318 3183.3294 3185.5216
redmass: 17.3767 12.8525 9.3120 5.8840 4.0223 6.8078 8.0697 6.0955 5.8912 6.5829 5.5382 3.2472 5.6406 6.9308 5.3682 6.2870 6.0784 6.2150 3.8550 4.5085 5.5836 4.6730 5.8544 3.2389 5.8895 6.2441 7.4210 7.2626 4.2089 4.4717 6.0715 8.1575 6.8258 6.4568 6.1173 5.9997 3.3085 3.3868 1.3976 2.2373 2.0770 1.3292 1.3945 1.8123 1.5213 3.9954 1.3715 1.3973 1.3161 8.8275 2.3322 5.8527 2.0717 5.9224 4.7754 2.9976 3.2051 2.4654 3.0360 1.6273 1.4250 1.3350 1.0883 1.3454 2.2035 1.6241 1.5725 1.9070 1.9291 1.1906 1.2725 1.8322 5.5173 1.5027 8.1922 3.6109 2.3914 1.0993 1.3776 1.7946 2.6518 1.1013 5.8952 7.4102 6.3174 6.8115 1.0640 1.0623 1.0710 1.0839 1.1012 1.1103 1.0860 1.0910 1.0900 1.0962 1.0918 1.0953 1.0957
irintensity: 0.1579 0.9420 0.0886 0.3752 3.0835 1.4392 2.0623 1.3947 0.2538 0.8964 2.3308 1.0686 1.9395 1.2513 1.0783 0.8934 0.8607 2.6122 3.4197 1.1907 10.7180 0.9687 5.1704 1.7017 10.2944 3.9185 8.2158 1.2878 0.6151 18.3456 0.4474 7.3424 5.0724 3.9688 3.1924 1.8172 4.2253 8.0854 85.9483 10.6525 29.7667 58.1378 1.4917 6.7447 34.5338 66.1298 1.8906 13.0763 0.0364 194.3673 50.0050 143.2169 26.5581 10.1133 34.5658 43.9857 57.5274 16.1460 56.5721 16.0119 7.2885 6.7547 2.2612 30.6930 126.7369 76.1489 18.2665 65.8617 197.6874 3.6475 7.0728 105.5598 10.4677 11.5053 7.7124 184.0727 30.8946 8.3126 87.7733 171.7594 21.7177 23.5095 0.7765 34.8335 4.5655 50.7309 7.3453 24.4394 10.9178 10.5131 23.0473 11.4714 0.4678 9.2184 2.8052 27.4891 2.3899 14.9214 0.7433
temp: 298.150 k
press: 1.00000 atm
elementType: 17 16 9 9 9 7 6 6 6 6 6 6 6 6 6 6 6 6 6 6 6 6 1 1 1 1 1 1 1 1 1 1 1 1 1
symmnumber: 1
zpe: 664622.9 jmol-1
zpe.correction: 0.253142 hartree
zpe.thermalcorrener: 0.271851 hartree
zpe.thermalcorrenthalpy: 0.272795 hartree
zpe.thermalcorrgfe: 0.204648 hartree
zpe.sumelectzpe: -1828.337048 hartree
zpe.sumelectthermal: -1828.318339 hartree
zpe.sumelectthermalent: -1828.317395 hartree
zpe.sumelectthermalfe: -1828.385542 hartree
dipole: -5.5424 2.1183 0.8952
dipole: 6.0005
quadrupole: -153.0645 -123.7544 -146.9608
quadrupole: -7.7543 -2.5008 3.0405
quadrupole: -11.8046 17.5055 -5.7009 -7.7543 -2.5008 3.0405
hfenergy: -1828.5901898 hartree
pointgroup: C01 [X(C16H13Cl1F3N1S1)]
dipole: -2.3066037 -0.3533349 -0.3578964 debye
polarizability: 315.6168888|1.161987|220.9843291|12.916392|7.632189|104.8555843 unknown
InChI: InChI=1S/C16H13ClF3NS/c17-8-3-9-21-12-4-1-2-5-14(12)22-15-7-6-11(10-13(15)21)16(18,19)20/h1-2,4-7,10H,3,8-9H2
charge 0 multiplicity 1
35 atoms
Cl 1.66223 -4.07229 0.540978
S  -1.601927 2.686248 0.755811
F  4.91918 1.099334 -0.370099
F  4.248166 -0.658963 0.898114
F  3.946738 -0.706585 -1.342211
N  -1.023081 -0.390543 0.435907
C  -0.768896 -1.828082 0.682145
C  0.104427 0.468035 0.277619
C  -2.359344 0.020528 0.129908
C  -0.020748 1.891132 0.312812
C  -0.519595 -2.678779 -0.594646
C  -2.749827 1.389872 0.155842
C  1.410412 -0.062479 0.102594
C  2.530274 0.789722 -0.042912
C  -3.36649 -0.930555 -0.19973
C  1.094704 2.72913 0.12501
C  2.386246 2.190046 -0.048146
C  -4.058835 1.790259 -0.174108
C  -0.053288 -4.098655 -0.276863
C  -4.689948 -0.534038 -0.489595
C  -5.045444 0.82976 -0.491658
C  3.879697 0.156594 -0.209313
H  0.106761 -1.913435 1.349098
H  -1.626827 -2.237942 1.244942
H  -1.449267 -2.758724 -1.192243
H  0.220297 -2.186518 -1.249934
H  1.579979 -1.141185 0.089344
H  -3.13004 -1.995785 -0.232799
H  0.952923 3.814418 0.138726
H  3.253055 2.842756 -0.174793
H  -4.309421 2.85649 -0.160113
H  0.078622 -4.706865 -1.183341
H  -0.703737 -4.618986 0.444186
H  -5.436324 -1.300121 -0.725267
H  -6.06567 1.145906 -0.729065
