program: Orca
programVersion: 5.0.2
elementType: N N N N N C C C C C C C C C C C C C C C H H H H H H H H H H H H H H H H H H H H H H H H H
charge: 0
multiplicity: 1
keywords: wb97x-d3
keywords: def2-TZVPP
keywords: def2/J RIJCOSX
keywords: DEFGRID2
keywords: scfconv7
keywords: smallprint printgap noloewdin
keywords: NOSOSCF
formula: C15H25N5
InChI: InChI=1/C15H25N5/c1-3-5-6-7-8-9-10-12-13(4-2)19-15-17-11-18-20(15)14(12)16/h11H,3-10,16H2,1-2H3
45 atoms
N  -0.813808 -1.210228 0.965741
N  0.354999 -1.77447 -0.996562
N  0.002426 0.015419 2.720181
N  -2.023048 -1.377422 1.521882
N  -1.936254 -2.344668 -0.521865
C  2.221806 2.637591 -0.017755
C  2.307492 1.898704 1.318823
C  1.037115 2.306452 -0.924867
C  2.530304 0.377636 1.259974
C  -0.339104 2.460106 -0.287157
C  1.373867 -0.442062 0.747983
C  -1.444513 1.861566 -1.148558
C  1.384232 -1.126087 -0.497947
C  -2.811679 1.862712 -0.477998
C  0.222302 -0.532243 1.509153
C  2.639898 -1.135198 -1.334454
C  -0.756964 -1.79964 -0.271258
C  -3.881849 1.195555 -1.330038
C  2.523589 -1.904891 -2.638164
C  -2.642713 -2.06043 0.577656
H  3.149656 2.470637 -0.575009
H  2.203967 3.708964 0.204799
H  3.14898 2.322425 1.874353
H  1.42268 2.128414 1.91704
H  1.09511 2.950605 -1.807691
H  1.132983 1.290031 -1.309805
H  2.800419 0.034597 2.266896
H  3.419891 0.180214 0.662055
H  -0.362013 1.973062 0.690827
H  -0.544213 3.518586 -0.093753
H  -1.176004 0.831189 -1.405523
H  -1.501471 2.396523 -2.102821
H  -3.107028 2.890935 -0.247234
H  -2.740912 1.343968 0.483246
H  3.455091 -1.55039 -0.732772
H  2.936819 -0.10237 -1.54375
H  -4.852192 1.201561 -0.832909
H  -4.000545 1.703038 -2.288973
H  -3.622912 0.156058 -1.539094
H  3.471246 -1.865071 -3.175391
H  1.749506 -1.489366 -3.280172
H  2.27261 -2.949526 -2.465663
H  -0.840765 -0.2441 3.205309
H  0.781265 0.32652 3.269411
H  -3.670205 -2.365417 0.705889
totalener: -860.50832230 hartree
nucrepener: 1713.10823296 hartree
electener: -2573.61655526 hartree
oneelecener: -4568.21471859 hartree
twoeener: 1994.59816334 hartree
kineticenergy: 856.59592197 hartree
xcener: -85.961052352863 hartree
chargesum: 0.0000000
charge: 0.194184 -0.285444 -0.244997 -0.388774 -0.297210 -0.175847 -0.129639 -0.110538 -0.224537 -0.126500 0.015462 -0.153921 0.145651 -0.095101 0.109800 -0.118770 0.154234 -0.256054 -0.242389 0.086684 0.073126 0.082315 0.087655 0.065665 0.086306 0.060246 0.098219 0.086678 0.051853 0.084885 0.071259 0.077446 0.062877 0.048214 0.085069 0.071740 0.081586 0.075255 0.078570 0.079936 0.088914 0.087834 0.169921 0.161251 0.126887
qa: 0.1942 -0.2854 -0.2450 -0.3888 -0.2972 -0.1758 -0.1296 -0.1105 -0.2245 -0.1265 0.0155 -0.1539 0.1457 -0.0951 0.1098 -0.1188 0.1542 -0.2561 -0.2424 0.0867 0.0731 0.0823 0.0877 0.0657 0.0863 0.0602 0.0982 0.0867 0.0519 0.0849 0.0713 0.0774 0.0629 0.0482 0.0851 0.0717 0.0816 0.0753 0.0786 0.0799 0.0889 0.0878 0.1699 0.1613 0.1269
va: 3.3223 2.9555 3.2431 2.7534 3.0400 3.9310 3.8265 3.8943 3.8746 3.8641 3.4990 3.8955 3.8180 3.8613 4.1659 3.8794 4.3710 3.9406 3.9665 4.0499 1.0075 1.0076 1.0105 1.0166 1.0099 1.0102 0.9998 1.0156 1.0067 1.0111 1.0055 1.0113 1.0099 1.0225 0.9988 1.0020 1.0057 1.0043 1.0135 1.0025 1.0110 1.0121 1.0418 1.0251 1.0021
dispcorr: -0.025729532 hartree
energy: -860.534051826945
dipole: 6.42377 -5.08147 1.34230 19.99830 -18.90253 1.09578 -7.70729 9.24073 1.53344
magnitude: 2.31386 au
magnitude: 5.88136 debye
