program: Orca
programVersion: 5.0.2
elementType: N N N N N C C C C C C C C C C C C C C C H H H H H H H H H H H H H H H H H H H H H H H H H
charge: 0
multiplicity: 1
keywords: wb97x-d3
keywords: def2-TZVPP
keywords: def2/J RIJCOSX
keywords: DEFGRID2
keywords: scfconv7
keywords: smallprint printgap noloewdin
keywords: NOSOSCF
formula: C15H25N5
InChI: InChI=1/C15H25N5/c1-3-5-6-7-8-9-10-12-13(4-2)19-15-17-11-18-20(15)14(12)16/h11H,3-10,16H2,1-2H3
45 atoms
N  -0.604534 -1.702221 1.453506
N  -0.098406 -1.742364 -0.845381
N  0.618234 -0.660834 3.087406
N  -1.529617 -2.166696 2.305835
N  -2.012933 -2.779712 0.182046
C  1.681943 2.611529 0.308703
C  2.234257 1.725575 1.42482
C  0.201927 2.423529 -0.007551
C  2.517169 0.262134 1.051463
C  -0.303255 3.406488 -1.055951
C  1.315714 -0.591659 0.745501
C  -1.798485 3.287914 -1.343387
C  0.97078 -1.031856 -0.560941
C  -2.261131 1.914351 -1.826323
C  0.481597 -0.967682 1.783423
C  1.85689 -0.674755 -1.728569
C  -0.893133 -2.076351 0.16481
C  -1.572428 1.442858 -3.098862
C  1.414103 -1.258646 -3.058985
C  -2.34012 -2.798994 1.47865
H  2.277478 2.469033 -0.600234
H  1.839998 3.655192 0.598106
H  3.180657 2.153066 1.767701
H  1.557026 1.777166 2.282961
H  0.014693 1.403997 -0.346145
H  -0.380525 2.54106 0.913427
H  3.086479 -0.197398 1.869613
H  3.20642 0.250719 0.206981
H  -0.089804 4.428162 -0.725549
H  0.266245 3.272824 -1.981398
H  -2.07277 4.038338 -2.091516
H  -2.355101 3.550272 -0.438074
H  -3.340133 1.953642 -1.996326
H  -2.117931 1.16742 -1.04093
H  2.878295 -1.001106 -1.509399
H  1.915166 0.416708 -1.803327
H  -0.500033 1.303334 -2.952908
H  -1.975815 0.486418 -3.430837
H  -1.702267 2.16056 -3.911221
H  0.414057 -0.927895 -3.330717
H  1.396215 -2.346425 -3.030796
H  2.102489 -0.948905 -3.845426
H  0.012087 -1.124676 3.743877
H  1.494903 -0.310655 3.424321
H  -3.220256 -3.301666 1.850212
totalener: -860.50831538 hartree
nucrepener: 1674.24064099 hartree
electener: -2534.74895637 hartree
oneelecener: -4490.48051316 hartree
twoeener: 1955.73155679 hartree
kineticenergy: 856.59500194 hartree
xcener: -85.959282570350 hartree
chargesum: 0.0000000
charge: 0.152866 -0.294792 -0.264851 -0.398704 -0.303513 -0.143043 -0.127158 -0.077007 -0.211050 -0.124710 -0.131372 -0.144078 0.205244 -0.094113 0.255797 -0.151971 0.188027 -0.262330 -0.239613 0.095542 0.062164 0.079638 0.086839 0.062778 -0.007973 0.073098 0.096532 0.086646 0.071235 0.065302 0.072285 0.066651 0.072333 0.058794 0.088018 0.081393 0.048384 0.103539 0.085749 0.086245 0.091714 0.081311 0.171760 0.159022 0.127370
qa: 0.1529 -0.2948 -0.2649 -0.3987 -0.3035 -0.1430 -0.1272 -0.0770 -0.2110 -0.1247 -0.1314 -0.1441 0.2052 -0.0941 0.2558 -0.1520 0.1880 -0.2623 -0.2396 0.0955 0.0622 0.0796 0.0868 0.0628 -0.0080 0.0731 0.0965 0.0866 0.0712 0.0653 0.0723 0.0667 0.0723 0.0588 0.0880 0.0814 0.0484 0.1035 0.0857 0.0862 0.0917 0.0813 0.1718 0.1590 0.1274
va: 3.3353 2.9693 3.2591 2.7715 3.0676 3.9037 3.8624 3.8163 3.8647 3.8865 3.6174 3.9215 3.7183 3.8606 4.0663 3.8902 4.3561 3.9411 3.9677 4.0705 1.0066 1.0099 1.0094 1.0202 1.0495 1.0189 1.0013 1.0168 1.0150 1.0021 1.0096 1.0117 1.0102 1.0085 1.0041 0.9948 0.9994 1.0045 1.0067 1.0128 1.0116 1.0031 1.0412 1.0277 1.0000
dispcorr: -0.023672308 hartree
energy: -860.531987686213
dipole: 7.44372 -5.87991 1.56381 25.79999 -24.73004 1.06996 -15.44709 16.71272 1.26563
magnitude: 2.27863 au
magnitude: 5.79181 debye
