program: Orca
programVersion: 5.0.2
elementType: N N N N N C C C C C C C C C C C C C C C H H H H H H H H H H H H H H H H H H H H H H H H H
charge: 0
multiplicity: 1
keywords: wb97x-d3
keywords: def2-TZVPP
keywords: def2/J RIJCOSX
keywords: DEFGRID2
keywords: scfconv7
keywords: smallprint printgap noloewdin
keywords: NOSOSCF
formula: C15H25N5
InChI: InChI=1/C15H25N5/c1-3-5-6-7-8-9-10-12-13(4-2)19-15-17-11-18-20(15)14(12)16/h11H,3-10,16H2,1-2H3
45 atoms
N  -0.03704 -3.070614 1.557608
N  1.423446 -3.333165 -0.27228
N  -0.612909 -1.089523 2.553723
N  -0.799832 -3.814983 2.371831
N  0.285971 -5.117712 0.874044
C  0.088377 2.553346 -0.193397
C  -0.039261 1.036035 -0.191597
C  -1.032061 3.244683 -0.958979
C  1.069015 0.340012 0.602858
C  -0.926199 4.764137 -0.943552
C  0.9165 -1.154454 0.64716
C  -2.05729 5.451758 -1.696607
C  1.561109 -2.025971 -0.268972
C  -1.963494 6.97205 -1.671239
C  0.079532 -1.723916 1.590463
C  2.479169 -1.447995 -1.316016
C  0.620442 -3.859003 0.645306
C  -3.098041 7.648386 -2.426486
C  3.032788 -2.463725 -2.30026
C  -0.557289 -5.025936 1.907862
H  1.054794 2.837848 -0.622937
H  0.101713 2.919904 0.839385
H  -1.018046 0.751936 0.210539
H  -0.030226 0.662883 -1.219996
H  -1.036484 2.890692 -1.995251
H  -1.997514 2.945241 -0.536734
H  1.101215 0.745139 1.621122
H  2.036922 0.6063 0.175396
H  -0.914623 5.116134 0.093764
H  0.034368 5.067154 -1.373749
H  -3.018076 5.141531 -1.271415
H  -2.06502 5.106736 -2.736233
H  -1.004178 7.283103 -2.095577
H  -1.958148 7.316598 -0.632739
H  3.30695 -0.939252 -0.810081
H  1.947099 -0.659513 -1.857649
H  -4.06841 7.383819 -2.003227
H  -3.010815 8.734516 -2.394373
H  -3.107446 7.350427 -3.476203
H  2.23629 -2.968563 -2.843467
H  3.615843 -3.231675 -1.79656
H  3.677216 -1.964703 -3.024123
H  -1.258188 -1.627845 3.107232
H  -0.730431 -0.095593 2.518858
H  -1.027144 -5.889073 2.354624
totalener: -860.51503813 hartree
nucrepener: 1503.70859782 hartree
electener: -2364.22363595 hartree
oneelecener: -4149.03526764 hartree
twoeener: 1784.81163170 hartree
kineticenergy: 856.59980222 hartree
xcener: -85.953836203441 hartree
chargesum: -0.0000000
charge: 0.145633 -0.307915 -0.270346 -0.399816 -0.307273 -0.103565 -0.131892 -0.105486 -0.173332 -0.101883 -0.123956 -0.106202 0.192835 -0.079864 0.239207 -0.133358 0.204883 -0.257700 -0.238739 0.097655 0.063396 0.052191 0.061746 0.074182 0.059642 0.054700 0.084279 0.091862 0.052120 0.055614 0.052095 0.053724 0.052730 0.051618 0.076732 0.076567 0.072486 0.085087 0.072780 0.085661 0.090198 0.078873 0.176574 0.159730 0.126526
qa: 0.1456 -0.3079 -0.2703 -0.3998 -0.3073 -0.1036 -0.1319 -0.1055 -0.1733 -0.1019 -0.1240 -0.1062 0.1928 -0.0799 0.2392 -0.1334 0.2049 -0.2577 -0.2387 0.0977 0.0634 0.0522 0.0617 0.0742 0.0596 0.0547 0.0843 0.0919 0.0521 0.0556 0.0521 0.0537 0.0527 0.0516 0.0767 0.0766 0.0725 0.0851 0.0728 0.0857 0.0902 0.0789 0.1766 0.1597 0.1265
va: 3.3425 3.0110 3.2763 2.7716 3.0655 3.8296 3.7913 3.8927 3.8092 3.8871 3.6625 3.8916 3.8164 3.8905 4.1107 3.9007 4.3613 3.9552 3.9649 4.0697 1.0151 1.0150 1.0203 1.0217 1.0123 1.0117 1.0110 1.0141 1.0122 1.0126 1.0105 1.0107 1.0078 1.0077 1.0016 0.9974 1.0031 1.0062 1.0032 1.0118 1.0126 1.0022 1.0392 1.0280 1.0002
dispcorr: -0.017421738 hartree
energy: -860.532459864319
dipole: -6.56452 6.11444 -0.45008 52.15758 -49.73423 2.42335 -18.53862 18.99169 0.45307
magnitude: 2.50609 au
magnitude: 6.36997 debye
