program: Orca
programVersion: 5.0.2
elementType: N N N N N C C C C C C C C C C C C C C C H H H H H H H H H H H H H H H H H H H H H H H H H
charge: 0
multiplicity: 1
keywords: wb97x-d3
keywords: def2-TZVPP
keywords: def2/J RIJCOSX
keywords: DEFGRID2
keywords: scfconv7
keywords: smallprint printgap noloewdin
keywords: NOSOSCF
formula: C15H25N5
InChI: InChI=1/C15H25N5/c1-3-5-6-7-8-9-10-12-13(4-2)19-15-17-11-18-20(15)14(12)16/h11H,3-10,16H2,1-2H3
45 atoms
N  -0.830838 -2.499543 0.470524
N  1.443073 -2.880712 0.954345
N  -1.684715 -0.74135 -0.721956
N  -2.032905 -3.045289 0.709693
N  -0.390118 -4.26166 1.680666
C  1.229827 2.790697 -1.076974
C  0.913543 1.519861 -0.300456
C  1.145433 4.063258 -0.237029
C  1.054267 0.255263 -1.149505
C  -0.217956 4.336529 0.394569
C  0.725515 -1.000315 -0.391109
C  -1.354781 4.4783 -0.609935
C  1.704321 -1.796609 0.252402
C  -2.684863 4.838127 0.040319
C  -0.599828 -1.379478 -0.247724
C  3.165755 -1.462384 0.1273
C  0.169284 -3.236484 1.059474
C  -3.814733 4.992831 -0.966899
C  3.781494 -2.111723 -1.111017
C  -1.693487 -4.093509 1.435472
H  0.562637 2.868356 -1.941714
H  2.239039 2.713198 -1.493497
H  1.576856 1.441652 0.566883
H  -0.100076 1.566242 0.108353
H  1.898505 4.014454 0.555277
H  1.423743 4.916453 -0.863038
H  2.065872 0.198517 -1.553916
H  0.417119 0.341289 -2.038495
H  -0.46508 3.550519 1.114936
H  -0.14771 5.257163 0.98167
H  -1.47831 3.546834 -1.173648
H  -1.092322 5.241995 -1.350753
H  -2.570742 5.766401 0.607895
H  -2.948738 4.069802 0.773324
H  3.665386 -1.840715 1.01875
H  3.324645 -0.382585 0.106837
H  -3.594379 5.778949 -1.690926
H  -3.976489 4.06994 -1.526849
H  -4.755541 5.248718 -0.4795
H  3.316709 -1.755429 -2.03148
H  3.658731 -3.193427 -1.073809
H  4.848074 -1.895878 -1.172185
H  -2.575337 -1.20491 -0.651221
H  -1.580661 -0.013591 -1.402719
H  -2.447402 -4.771484 1.806222
totalener: -860.51262681 hartree
nucrepener: 1562.66744461 hartree
electener: -2423.18007142 hartree
oneelecener: -4266.80362320 hartree
twoeener: 1843.62355179 hartree
kineticenergy: 856.60161243 hartree
xcener: -85.954719668144 hartree
chargesum: 0.0000000
charge: 0.145044 -0.294214 -0.271273 -0.400783 -0.305814 -0.131940 -0.137968 -0.153245 -0.199328 -0.127062 -0.079447 -0.115119 0.170890 -0.083077 0.225103 -0.142437 0.217133 -0.250731 -0.261785 0.096980 0.063767 0.081352 0.084232 0.073186 0.075607 0.075406 0.090625 0.083173 0.067371 0.076187 0.039726 0.063394 0.054646 0.055164 0.095898 0.065997 0.073245 0.066376 0.087684 0.072478 0.104048 0.088129 0.175081 0.159272 0.127027
qa: 0.1450 -0.2942 -0.2713 -0.4008 -0.3058 -0.1319 -0.1380 -0.1532 -0.1993 -0.1271 -0.0794 -0.1151 0.1709 -0.0831 0.2251 -0.1424 0.2171 -0.2507 -0.2618 0.0970 0.0638 0.0814 0.0842 0.0732 0.0756 0.0754 0.0906 0.0832 0.0674 0.0762 0.0397 0.0634 0.0546 0.0552 0.0959 0.0660 0.0732 0.0664 0.0877 0.0725 0.1040 0.0881 0.1751 0.1593 0.1270
va: 3.3411 3.0493 3.2626 2.7689 3.0626 3.8411 3.7782 3.9228 3.8454 3.8670 3.5730 3.8627 3.8825 3.8925 4.1388 3.8952 4.3504 3.9506 3.9157 4.0711 1.0060 1.0146 1.0188 1.0183 1.0104 1.0097 1.0147 1.0093 1.0057 1.0125 1.0091 1.0112 1.0097 1.0079 1.0255 1.0057 1.0033 1.0034 1.0068 1.0048 1.0067 1.0059 1.0395 1.0287 1.0002
dispcorr: -0.019111958 hartree
energy: -860.531738770369
dipole: 1.62435 -1.94043 -0.31609 42.27950 -40.23675 2.04275 -11.74070 10.34302 -1.39768
magnitude: 2.49524 au
magnitude: 6.34241 debye
