program: Gaussian 09
title: 000069327
version: EM64L-G09RevD.01
frameworkgroup: C1[X(C10H8N2)]
method: RPBEPBE
basis: SDD
operation: Freq
keyword: #pfreq=noraman
keyword: PBEPBE/SDD
title: #p freq=noraman PBEPBE/SDD
converged: YES YES YES YES
title: Mulliken charges:
elementType: N N C C C C C C C C C C H H H H H H H H
charge: -0.006835 -0.006830 0.459906 0.459908 -0.367423 -0.367403 -0.367365 -0.367385 -0.592545 -0.592541 -0.122271 -0.122283 0.240339 0.240344 0.240349 0.240346 0.257927 0.257918 0.257920 0.257922
chargesum: 0.00000
title: Mulliken charges with hydrogens summed into heavy atoms:
elementType: N N C C C C C C C C C C
charge: -0.006835 -0.006830 0.459906 0.459908 -0.127084 -0.127059 -0.127016 -0.127039 -0.076700 -0.076698 -0.122271 -0.122283
polarizability: 1.43198691e+02 -1.21416480e-03 8.76050099e+01 -1.22731156e-03 1.40679407e-02 9.54707090e+01
1716.lowfreq: -20.8163 -19.8459 -6.2242 -0.0005 -0.0005 0.0008 2.5011 13.8415 48.3792
frequency: -20.4654 -19.4166 48.3792 106.6329 179.3158 259.6679 323.1407 352.0189 352.3775 358.5320 368.9655 402.4012 479.6668 494.3028 628.8540 636.0712 707.2563 793.0137 803.1032 847.5117 857.2921 900.2298 921.6395 924.3422 932.3457 965.2410 974.9139 1014.7844 1119.5764 1181.6216 1181.6785 1196.5697 1205.1732 1207.1047 1295.2152 1298.1286 1322.4868 1385.5478 1413.4850 1449.5363 1450.9332 1508.6570 1593.3266 1624.2577 2199.0960 2199.2857 3000.3572 3000.6004 3054.9287 3055.0092 3124.9433 3126.2661 3144.8954 3150.6412
redmass: 4.4456 4.1220 11.2709 8.8736 7.1443 2.5442 6.7415 2.9125 3.4922 2.9911 9.0141 2.8002 3.4134 8.2780 3.6506 6.6471 3.8396 4.1325 2.7793 1.2517 2.5395 1.8185 1.7954 3.8241 4.0604 1.4851 1.3914 3.0614 1.4025 1.1033 1.1193 1.1501 3.7158 1.9070 1.4725 1.5283 1.2452 7.0363 2.5786 1.0937 1.0779 2.5684 6.7507 6.4262 12.4246 12.4216 1.0591 1.0592 1.1008 1.1007 1.0878 1.0880 1.0968 1.0980
irintensity: 3.4331 0.0000 0.2699 8.8186 0.3800 4.8662 0.1396 0.0000 0.1675 0.0000 1.3324 0.0000 12.9845 2.4201 18.5558 0.0000 2.6465 11.4345 34.7446 0.0063 25.5249 0.0417 0.0000 1.4918 0.0012 0.0103 0.0000 6.1329 8.4715 0.0018 1.8114 0.1264 0.7701 0.3027 0.1534 1.3590 0.0000 0.2137 6.8191 19.5676 25.0747 22.5959 0.0000 1.3547 8.0527 8.7109 10.1172 7.9674 0.0079 4.8919 0.0001 17.7523 24.6152 0.1904
temp: 298.150 k
press: 1.00000 atm
elementType: 7 7 6 6 6 6 6 6 6 6 6 6 1 1 1 1 1 1 1 1
symmnumber: 1
zpe: 395493.3 jmol-1
zpe.correction: 0.150635 hartree
zpe.thermalcorrener: 0.159854 hartree
zpe.thermalcorrenthalpy: 0.160798 hartree
zpe.thermalcorrgfe: 0.115340 hartree
zpe.sumelectzpe: -494.502688 hartree
zpe.sumelectthermal: -494.493470 hartree
zpe.sumelectthermalent: -494.492526 hartree
zpe.sumelectthermalfe: -494.537984 hartree
dipole: 0.0002 -6.9377 0.0042
dipole: 6.9377
quadrupole: -84.2421 -83.6820 -61.0901
quadrupole: 0.0001 0.0026 0.0155
quadrupole: -7.9040 -7.3440 15.2480 0.0001 0.0026 0.0155
hfenergy: -494.6533239 hartree
pointgroup: C01 [X(C10H8N2)]
dipole: 0.0001287 2.7295119 -0.0010357 debye
dipolederiv: -0.2578038 -0.0081781 0.0000043 -0.1404428 -0.2342963 0.0000201 0.0000325 -0.0000005 -0.2226465 -0.2578135 0.0081833 0.0000011 0.1404993 -0.2342798 -0.0000088 -0.000066 0.0000027 -0.2226421 0.342598 0.0949483 -0.0000472 0.0741474 -0.106677 0.0000267 -0.0000396 0.0000181 -0.0073041 0.3425751 -0.09497 0.00002 -0.0741655 -0.1066753 0.0000559 0.0000055 0.0000509 -0.0073054 -0.1152221 -0.0210289 -0.0749304 0.0030984 -0.1280856 -0.0154132 -0.0587554 0.0045264 0.0601783 -0.1151977 0.0210264 0.0749489 -0.0031065 -0.1280833 -0.0154172 0.0587808 0.0045202 0.0601536 -0.1152085 -0.0209408 0.0749651 0.0032058 -0.1280622 0.0156539 0.0587879 -0.0042868 0.0601406 -0.1152165 0.0209473 -0.0749436 -0.0031956 -0.1280684 0.0156589 -0.0587511 -0.0042911 0.0601651 0.155894 -0.0674023 0.000016 -0.0800125 0.0784103 0.0000346 -0.000033 0.0000361 0.2231303 0.1558974 0.0674161 -0.0000245 0.0799814 0.0784156 0.0000616 -0.0000112 0.0000606 0.2231319 -0.1263259 0.0811926 -0.0000116 0.1797155 0.1393575 -0.0000677 -0.0000143 -0.0000497 -0.0504405 -0.1263097 -0.0812014 0.0000411 -0.1797295 0.1393334 -0.0000755 0.0000868 -0.0000821 -0.0504479 0.0203184 0.0158544 0.0947141 -0.0001746 0.1443998 -0.0006674 0.0909809 0.0020043 -0.0319355 0.0202939 -0.0158486 -0.0947175 0.0001805 0.1443993 -0.0006608 -0.0909879 0.0020116 -0.0319046 0.0203036 0.0157394 -0.0947244 -0.0002812 0.1443945 0.0004442 -0.0909893 -0.0022203 -0.0318986 0.0203272 -0.0157347 0.0947204 0.0002873 0.1443946 0.0004411 0.090981 -0.0022215 -0.0319284 0.0376893 -0.0163058 -0.0202283 -0.0111662 0.0453159 0.0354477 -0.0778364 0.0824538 0.0003705 0.0377548 -0.0163284 0.0202159 -0.011124 0.0452438 -0.0354839 0.0778503 -0.0824841 0.0004069 0.0377211 0.0163021 -0.0202346 0.0110993 0.0452213 -0.0354899 -0.0778579 -0.0824944 0.0004523 0.0377248 0.0163289 0.0202152 0.0111834 0.0453418 0.0354396 0.0778363 0.0824458 0.000324 unknown
polarizability: 143.1986906|0.0000611|87.6050041|-0.0003004|0.0123226|95.4707149 unknown
InChI: InChI=1S/C10H8N2/c11-7-5-9-1-2-10(4-3-9)6-8-12/h1-4H,5-6H2
charge 0 multiplicity 1
20 atoms
N  -3.980248 -1.82704 0.000661
N  3.980107 -1.827287 0.00066
C  -1.424656 0.644914 -0.000126
C  1.424806 0.644853 -0.00035
C  -0.705543 0.643389 1.219084
C  0.705887 0.64336 1.218973
C  -0.705734 0.641924 -1.219451
C  0.705692 0.641894 -1.219561
C  -2.956547 0.640505 -0.00001
C  2.956698 0.640379 -0.000475
C  -3.525277 -0.724136 0.000367
C  3.525368 -0.724287 0.000142
H  -1.247744 0.640576 2.171935
H  1.248236 0.640522 2.171739
H  -1.248085 0.637955 -2.172213
H  1.247893 0.637902 -2.172408
H  -3.345714 1.172869 -0.887976
H  -3.345581 1.173313 0.887746
H  3.345897 1.17338 0.887093
H  3.345746 1.172513 -0.888629
