program: Orca
programVersion: 5.0.2
elementType: N N N N N C C C C C C C C C C C C C C C H H H H H H H H H H H H H H H H H H H H H H H H H
charge: 0
multiplicity: 1
keywords: wb97x-d3
keywords: def2-TZVPP
keywords: def2/J RIJCOSX
keywords: DEFGRID2
keywords: scfconv7
keywords: smallprint printgap noloewdin
keywords: NOSOSCF
formula: C15H25N5
InChI: InChI=1/C15H25N5/c1-3-5-6-7-8-9-10-12-13(4-2)19-15-17-11-18-20(15)14(12)16/h11H,3-10,16H2,1-2H3
45 atoms
N  0.280189 -2.762833 1.669065
N  0.014704 -2.66272 -0.669962
N  0.29599 -0.980939 3.106597
N  0.465823 -3.670913 2.639082
N  0.302468 -4.675523 0.617894
C  1.240243 3.01894 1.033911
C  1.301079 1.508132 0.821295
C  0.398292 3.783171 0.014158
C  -0.071479 0.830218 0.813579
C  0.876561 3.628838 -1.425456
C  0.010375 -0.665851 0.698484
C  0.054962 4.417737 -2.441203
C  -0.062796 -1.354127 -0.537341
C  -1.367902 3.9009 -2.628399
C  0.203087 -1.425475 1.841063
C  -0.291997 -0.602315 -1.819893
C  0.183461 -3.370385 0.43954
C  -2.134228 4.667613 -3.696565
C  -1.781944 -0.428258 -2.108453
C  0.467617 -4.789693 1.939519
H  2.26049 3.413907 1.025721
H  0.848493 3.223264 2.035906
H  1.816468 1.274625 -0.114158
H  1.924164 1.064769 1.604427
H  -0.648265 3.477942 0.100007
H  0.412871 4.845171 0.277972
H  -0.674005 1.228614 -0.003154
H  -0.626025 1.108515 1.717939
H  1.923028 3.944459 -1.483961
H  0.868798 2.572677 -1.715696
H  0.567105 4.39166 -3.407845
H  0.02448 5.472851 -2.147921
H  -1.916529 3.955641 -1.684488
H  -1.332221 2.838949 -2.894647
H  0.166297 -1.177801 -2.623791
H  0.202958 0.370801 -1.803109
H  -2.215066 5.725619 -3.441776
H  -1.636228 4.602373 -4.665241
H  -3.146009 4.281361 -3.82017
H  -2.272839 -1.398309 -2.174221
H  -1.934534 0.092575 -3.05395
H  -2.283252 0.146431 -1.328493
H  0.527371 -1.643559 3.827651
H  0.430664 -0.006106 3.291918
H  0.597299 -5.742732 2.429766
totalener: -860.51138645 hartree
nucrepener: 1587.81884587 hartree
electener: -2448.33023232 hartree
oneelecener: -4317.10874357 hartree
twoeener: 1868.77851126 hartree
kineticenergy: 856.59937932 hartree
xcener: -85.956787722251 hartree
chargesum: 0.0000000
charge: 0.144247 -0.295130 -0.269272 -0.402800 -0.306027 -0.153927 -0.135791 -0.122250 -0.181637 -0.151735 -0.092487 -0.120269 0.152920 -0.074747 0.227994 -0.100544 0.217670 -0.261431 -0.284573 0.097868 0.076893 0.069963 0.089598 0.080144 0.063795 0.080279 0.064531 0.091896 0.084119 0.066731 0.069951 0.056486 0.056843 0.041793 0.097755 0.038120 0.075620 0.074929 0.085562 0.113595 0.088025 0.081335 0.177089 0.159845 0.127022
qa: 0.1442 -0.2951 -0.2693 -0.4028 -0.3060 -0.1539 -0.1358 -0.1223 -0.1816 -0.1517 -0.0925 -0.1203 0.1529 -0.0747 0.2280 -0.1005 0.2177 -0.2614 -0.2846 0.0979 0.0769 0.0700 0.0896 0.0801 0.0638 0.0803 0.0645 0.0919 0.0841 0.0667 0.0700 0.0565 0.0568 0.0418 0.0978 0.0381 0.0756 0.0749 0.0856 0.1136 0.0880 0.0813 0.1771 0.1598 0.1270
va: 3.3414 3.0537 3.2787 2.7688 3.0632 3.8936 3.7895 3.8437 3.8153 3.9006 3.5730 3.8983 3.9289 3.8755 4.1542 3.8720 4.3499 3.9661 3.9129 4.0699 1.0117 1.0109 1.0107 1.0204 1.0052 1.0132 1.0184 1.0096 1.0146 1.0028 1.0103 1.0113 1.0068 1.0095 1.0324 1.0152 1.0027 1.0037 1.0055 1.0103 1.0044 1.0008 1.0390 1.0288 1.0001
dispcorr: -0.021037653 hartree
energy: -860.532424100980
dipole: -5.82856 5.94890 0.12035 45.06371 -42.73758 2.32613 -18.61514 19.56438 0.94924
magnitude: 2.51524 au
magnitude: 6.39324 debye
